{"text_format":"1","workbook":"xlsx","n_sheets":6,"sheets":["Examples","Read Me 1st","Product benefit & adoption","Net benefits $m by product","PV calculation","Formatting"],"not_rendered":{"charts":15,"images":1,"macros":1,"external_links":0,"defined_names":1,"comments":4,"pivot_tables":0},"unopened":[],"bounds":{"document_bytes":16777216,"sheet_cells":100000,"rows_first":2000,"rows_last":500,"rows_between":2000,"halvings":0,"cell_chars":16384,"cell_head_chars":4096},"cells_cut":0,"cells_raw":0,"read":"whole","date_system":"1900"}

{"sheet":"Examples","index":0,"n_rows":22,"n_cols":27,"rows_kept":22,"cut":false,"hidden":true,"merged":[]}
[null,"Teal","Red","Light grey","Mid-grey","Grey","Light teal","Mid-red","Light red",null,null,"Teal solid","Red  solid","Mid-grey","Teal dashes","Red  dashes","Grey dashes",null,"X value","1st Y value","2nd Y value",null,null,"Teal","Red","Mid-red","Mid-grey"]
["2003-04",36.19,36.880000000000003,21.56,5.36,3.01,10,3.01,10,null,"2003-04",33.19,36.880000000000003,21.56,5.36,3.01,10,null,1.8,10,17,null,"2003-04",33.19,36.880000000000003,21.56,5.36]
["2004-05",39.39,32.020000000000003,21.6,7.01,3.36,12,3.36,12,null,"2004-05",39.39,32.020000000000003,21.6,7.01,3.36,12,null,2.2999999999999998,12,9,null,"2004-05",39.39,32.020000000000003,21.6,7.01]
["2005-06",42.78,29.91,18.350000000000001,6.33,2.63,14,2.63,14,null,"2005-06",42.78,29.91,18.350000000000001,6.33,2.63,14,null,3.7,16,14,null,"2005-06",42.78,29.91,18.350000000000001,6.33]
["2006-07",42.13,26.53,21.6,7.01,2.72,16,2.72,16,null,"2006-07",42.13,26.53,21.6,7.01,2.72,16,null,4.0999999999999996,8,23,null,"2006-07",42.13,26.53,21.6,7.01]
["2007-08",41.69,24.76,23.98,7,2.57,18,2.57,18,null,"2007-08",41.69,24.76,23.98,7,2.57,18,null,5.5,14,27,null,"2007-08",41.69,24.76,23.98,7]
["2008-09",39.39,32.020000000000003,21.6,7.01,3.36,12,3.36,12,null,"2008-09",39.39,32.020000000000003,21.6,7.01,3.36,12,null,null,null,null,null,"2008-09",39.39,32.020000000000003,21.6,7.01]
["2009-10",42.13,26.53,21.6,7.01,2.72,16,2.72,16,null,"2009-10",42.13,26.53,21.6,7.01,2.72,16,null,null,null,null,null,"2009-10",42.13,26.53,21.6,7.01]
["2010-11",45,22,26,8,2,20,2,20,null,"2010-11",45,22,26,8,2,20,null,null,null,null,null,"2010-11",45,22,26,8]
[]
["–  en rule for when needed"]
[]
[]
[]
[]
[]
[null,null,null,null,null,null,null,null,null,null,null,null,null,null,null,null,null,null,"X value","1st Y value","2nd Y value","3rd Y value","4th Y value","5th Y value","6th Y value"]
[null,null,null,null,null,null,null,null,null,null,null,null,null,null,null,null,null,null,1.8,10,17,24,20,22,15]
[null,null,null,null,null,null,null,null,null,null,null,null,null,null,null,null,null,null,2.2999999999999998,12,9,6,8,14,18]
[null,null,null,null,null,null,null,null,null,null,null,null,null,null,null,null,null,null,3.7,16,14,12,10,8,6]
[null,null,null,null,null,null,null,null,null,null,null,null,null,null,null,null,null,null,4.0999999999999996,8,23,38,25,30,17]
[null,null,null,null,null,null,null,null,null,null,null,null,null,null,null,null,null,null,5.5,14,27,5,18,31,26]

{"sheet":"Read Me 1st","index":1,"n_rows":19,"n_cols":6,"rows_kept":19,"cut":false,"hidden":false,"merged":[[8,5,8,10]]}
[]
[null,"Title","MLA Product Adoption and Impact Template"]
[null,"MLA sub program"]
[null,"Program manager"]
[null,"Prepared by","George Waldthausen"]
[null,"Reviewed by","George Waldthausen"]
[null,"Last modified","10 November 2023"]
[null,"Purpose of the worksheet","This is a general purpose template spreadsheet that allows input of product level ('bottom up') first round adoption and impact data."]
[null,"Overview of approach (impact)","For each product/value proposition, enter the net impact per unit of adoption impact, having deducted any costs for achieving that impact. If the product has multiple impacts which cannot be directly added (e.g. each impact has differing adoption profiles), use multiple rows.\n",null,null,"This template is published by Meat & Livestock Australia Limited ABN 39 081 678 364 (MLA). Reproduction in whole or in part of this document is prohibited without the prior consent of MLA "]
[null,"Impact attribution","Estimate (based on investment costs) the maximum total attribution to MLA versus any other parties e.g. other RDC's.  The default is 100% attribution to MLA.\nFinally, split this maximum MLA attribution into the various 5-year MLA investment time periods."]
[null,"Impact allocation to benefit type and species","To assist in calculating second round economic benefits via the MLA GMI/IF partial equilibrium model, impacts are allocated to benefit types and species/sectors.  Please consult with MLA if you wish to add this data."]
[null,"Overview of approach (adoption)","For each product, input the annual actual or estimated adoption number, starting at the year of first adoption."]
[null,"Overview of approach (calculation)","Annual impact (in $m) will be adoption x attributed impact for that time period.  The total impact for that product will depend on the time period chosen i.e. ALL = 2015-2045 (30 years), 2015-20 = 2015-2040 (25 years), 2020-25 = 2020-2045 (25 years).  The default is ALL years."]
[]
[null,"Contents","Purpose and description"]
[null,"Product benefit & adoption","Enter the impact, attribution, unit of adoption and adoption numbers."]
[null,"Net benefits $m by product","Calculates annual benefits based on the above, both without and with NPV calculations."]
[null,"PV calculation","Provides factors for both NPV discounts (5%) and CPI adjustments.  Note that impacts are assumed to be estimated on current year numbers, and hence no CPI adjustment is needed.\nThe base year will be the current fiscal year, but this can be adjusted using this tab."]
[null,"Formatting","This are the standard MLA formatting styles to be used."]

{"sheet":"Product benefit & adoption","index":2,"n_rows":93,"n_cols":56,"rows_kept":93,"cut":false,"hidden":false,"merged":[[8,16,8,17],[8,18,8,20],[8,21,8,24],[8,26,8,55],[1,1,1,6],[6,10,6,14],[6,16,6,24]]}
["H"]
[null,"Benefits and adoption by product: allocation between type of benefit and species"]
[]
[null,null,"NPV Base year","FY23",null,"Select impact time period","ALL","Options:"]
[null,null,"Time period",{"$f":"$G$4","v":"ALL"},null,null,null,"2015-20"]
[null,null,"Sector receiving initial impact (shock)","Producer",null,null,null,"2020-25"]
[null,null,null,null,null,null,null,"ALL",null,null,"MLA attribution to 5-year planning periods (must add to 100%)",null,null,null,null,null,"Allocation to benefit type,species and producer sector.  (must add to 100%)"]
[]
[null,null,null,null,null,null,null,null,null,null,null,null,null,null,null,null,"Benefit split",null,"Cost reduction split by sector",null,null,"Productivity) benefit split by sector",null,null,null,null,"Annual adoption profile by product"]
[null,"Item","MLA Sub program","MLA Product category","MLA Product code","Product (value proposition, extension program etc)","Outcome (adoption) comment","Economic impact rating ","Adoption start year","$ pre attribution annual net benefit per unit adopted","% attribution to 2015/20 MLA cash investment","$ attribution to 2015/20 MLA cash investment","% attribution to 2020/25 MLA cash investment","$ attribution to 2020/25 MLA cash investment","Max % attribution to MLA (all periods)","Max $ attribution impact to MLA (all periods)","Cost Reduction %","Productivity  Benefit  %","Northern  grass fed beef %","Southern  grass fed beef %","Lamb/Adult  Sheep  %","Northern  grass fed beef %","Southern  grass fed beef %","Lamb %","Adult Sheep %","Adoption Unit","2015-16","2016-17","2017-18","2018-19","2019-20","2020-21","2021-22","2022-23","2023-24","2024-25","2025-26","2026-27","2027-28","2028-29","2029-30","2030-31","2031-32","2032-33","2033-34","2034-35","2035-36","2036-37","2037-38","2038-39","2039-40","2040-41","2041-42","2042-43","2043-44","2044-45"]
[null,1,"e.g. Feedbase Productivity","Pasture variety","p00506","e.g Tropical pastures into  temperate zone\n\n",null,"Medium","2019/20",10,0,{"$f":"K11*$J11","v":0},1,{"$f":"M11*$J11","v":10},1,{"$f":"O11*$J11","v":10},0,1,1,0,0,1,0,0,0,"Head",null,null,null,null,null,10000,10000,20000,30000,50000,70000,100000,100000,90000,80000,70000,60000,50000,50000,50000,50000,50000,50000,50000,50000]
[null,2,"e.g. Beef Productivity","Reproductive efficiency","p00593","e.g. Calf survival/weaning productivity tools, practices and extension program",null,"High","2020/21",10,0,{"$f":"K12*$J12","v":0},1,{"$f":"M12*$J12","v":10},1,{"$f":"O12*$J12","v":10},0,1,1,0,0,1,0,0,0,"Head",null,null,null,null,null,20000,100000,200000,500000,500000,500000,500000,600000,700000,800000,900000,1000000,1100000,1200000,1300000,1400000,1500000,1600000,1700000,1800000,1800000,1800000,1800000,1800000,1800000]
[null,3,null,null,null,null,null,null,null,null,0,{"$f":"K13*$J13","v":0},1,0,1,{"$f":"O13*$J13","v":0}]
[null,4,null,null,null,null,null,null,null,null,0,{"$f":"K14*$J14","v":0},1,0,1,{"$f":"O14*$J14","v":0}]
[null,5,null,null,null,null,null,null,null,null,0,{"$f":"K15*$J15","v":0},1,0,1,{"$f":"O15*$J15","v":0}]
[null,6,null,null,null,null,null,null,null,null,0,{"$f":"K16*$J16","v":0},1,0,1,{"$f":"O16*$J16","v":0}]
[null,7,null,null,null,null,null,null,null,null,0,{"$f":"K17*$J17","v":0},1,0,1,{"$f":"O17*$J17","v":0}]
[null,8,null,null,null,null,null,null,null,null,0,{"$f":"K18*$J18","v":0},1,0,1,{"$f":"O18*$J18","v":0}]
[null,9,null,null,null,null,null,null,null,null,0,{"$f":"K19*$J19","v":0},1,0,1,{"$f":"O19*$J19","v":0}]
[null,10,null,null,null,null,null,null,null,null,0,{"$f":"K20*$J20","v":0},1,0,1,{"$f":"O20*$J20","v":0}]
[null,11,null,null,null,null,null,null,null,null,0,{"$f":"K21*$J21","v":0},1,0,1,{"$f":"O21*$J21","v":0}]
[null,12,null,null,null,null,null,null,null,null,0,{"$f":"K22*$J22","v":0},1,0,1,{"$f":"O22*$J22","v":0}]
[null,13,null,null,null,null,null,null,null,null,0,{"$f":"K23*$J23","v":0},1,0,1,{"$f":"O23*$J23","v":0}]
[null,14,null,null,null,null,null,null,null,null,0,{"$f":"K24*$J24","v":0},1,0,1,{"$f":"O24*$J24","v":0}]
[null,15,null,null,null,null,null,null,null,null,0,{"$f":"K25*$J25","v":0},1,0,1,{"$f":"O25*$J25","v":0}]
[null,16,null,null,null,null,null,null,null,null,0,{"$f":"K26*$J26","v":0},1,0,1,{"$f":"O26*$J26","v":0}]
[null,17,null,null,null,null,null,null,null,null,0,{"$f":"K27*$J27","v":0},1,0,1,{"$f":"O27*$J27","v":0}]
[null,18,null,null,null,null,null,null,null,null,0,{"$f":"K28*$J28","v":0},1,0,1,{"$f":"O28*$J28","v":0}]
[null,19,null,null,null,null,null,null,null,null,0,{"$f":"K29*$J29","v":0},1,0,1,{"$f":"O29*$J29","v":0}]
[null,20,null,null,null,null,null,null,null,null,0,{"$f":"K30*$J30","v":0},1,0,1,{"$f":"O30*$J30","v":0}]
[null,21,null,null,null,null,null,null,null,null,0,{"$f":"K31*$J31","v":0},1,0,1,{"$f":"O31*$J31","v":0}]
[null,22,null,null,null,null,null,null,null,null,0,{"$f":"K32*$J32","v":0},1,0,1,{"$f":"O32*$J32","v":0}]
[null,23,null,null,null,null,null,null,null,null,0,{"$f":"K33*$J33","v":0},1,0,1,{"$f":"O33*$J33","v":0}]
[null,24,null,null,null,null,null,null,null,null,0,{"$f":"K34*$J34","v":0},1,0,1,{"$f":"O34*$J34","v":0}]
[null,25,null,null,null,null,null,null,null,null,0,{"$f":"K35*$J35","v":0},1,0,1,{"$f":"O35*$J35","v":0}]
[null,26,null,null,null,null,null,null,null,null,0,{"$f":"K36*$J36","v":0},1,0,1,{"$f":"O36*$J36","v":0}]
[null,27,null,null,null,null,null,null,null,null,0,{"$f":"K37*$J37","v":0},1,0,1,{"$f":"O37*$J37","v":0}]
[null,28,null,null,null,null,null,null,null,null,0,{"$f":"K38*$J38","v":0},1,0,1,{"$f":"O38*$J38","v":0}]
[null,29,null,null,null,null,null,null,null,null,0,{"$f":"K39*$J39","v":0},1,0,1,{"$f":"O39*$J39","v":0}]
[null,30,null,null,null,null,null,null,null,null,0,{"$f":"K40*$J40","v":0},1,0,1,{"$f":"O40*$J40","v":0}]
[null,31,null,null,null,null,null,null,null,null,0,{"$f":"K41*$J41","v":0},1,0,1,{"$f":"O41*$J41","v":0}]
[null,32,null,null,null,null,null,null,null,null,0,{"$f":"K42*$J42","v":0},1,0,1,{"$f":"O42*$J42","v":0}]
[null,33,null,null,null,null,null,null,null,null,0,{"$f":"K43*$J43","v":0},1,0,1,{"$f":"O43*$J43","v":0}]
[null,34,null,null,null,null,null,null,null,null,0,{"$f":"K44*$J44","v":0},1,0,1,{"$f":"O44*$J44","v":0}]
[null,35,null,null,null,null,null,null,null,null,0,{"$f":"K45*$J45","v":0},1,0,1,{"$f":"O45*$J45","v":0}]
[null,36,null,null,null,null,null,null,null,null,0,{"$f":"K46*$J46","v":0},1,0,1,{"$f":"O46*$J46","v":0}]
[null,37,null,null,null,null,null,null,null,null,0,{"$f":"K47*$J47","v":0},1,0,1,{"$f":"O47*$J47","v":0}]
[null,38,null,null,null,null,null,null,null,null,0,{"$f":"K48*$J48","v":0},1,0,1,{"$f":"O48*$J48","v":0}]
[null,39,null,null,null,null,null,null,null,null,0,{"$f":"K49*$J49","v":0},1,0,1,{"$f":"O49*$J49","v":0}]
[null,40,null,null,null,null,null,null,null,null,0,{"$f":"K50*$J50","v":0},1,0,1,{"$f":"O50*$J50","v":0}]
[null,41,null,null,null,null,null,null,null,null,0,{"$f":"K51*$J51","v":0},1,0,1,{"$f":"O51*$J51","v":0}]
[null,42,null,null,null,null,null,null,null,null,0,{"$f":"K52*$J52","v":0},1,0,1,{"$f":"O52*$J52","v":0}]
[null,43,null,null,null,null,null,null,null,null,0,{"$f":"K53*$J53","v":0},1,0,1,{"$f":"O53*$J53","v":0}]
[null,44,null,null,null,null,null,null,null,null,0,{"$f":"K54*$J54","v":0},1,0,1,{"$f":"O54*$J54","v":0}]
[null,45,null,null,null,null,null,null,null,null,0,{"$f":"K55*$J55","v":0},1,0,1,{"$f":"O55*$J55","v":0}]
[null,46,null,null,null,null,null,null,null,null,0,{"$f":"K56*$J56","v":0},1,0,1,0]
[]
[]
[]
[]
[]
[]
[]
[]
[]
[]
[]
[]
[]
[]
[]
[]
[]
[]
[]
[]
[]
[]
[]
[]
[]
[]
[]
[null,null,null,null,null,null,null,null,null,null,null,null,null,null,null,null,null,"Base Year"]
[null,null,"2015-20 totals"]
[null,null,"TOTAL (pre CPI/NPV)",{"$f":"SUM('Net benefits $m by product'!#REF!)","v":{"$error":"#REF!"}}]
[null,null,"TOTAL (post CPI)",{"$f":"SUM('Net benefits $m by product'!#REF!)","v":{"$error":"#REF!"}}]
[null,null,"TOTAL (post CPU/NPV 5%)",{"$f":"SUM('Net benefits $m by product'!#REF!)","v":{"$error":"#REF!"}}]
[]
[null,null,"2020-40 totals"]
[null,null,"TOTAL (pre CPI/NPV)",{"$f":"SUM('Net benefits $m by product'!#REF!)","v":{"$error":"#REF!"}}]
[null,null,"TOTAL (post CPI)",{"$f":"SUM('Net benefits $m by product'!#REF!)","v":{"$error":"#REF!"}}]
[null,null,"TOTAL (post NPV 5%)",{"$f":"SUM('Net benefits $m by product'!#REF!)","v":{"$error":"#REF!"}}]

{"sheet":"Net benefits $m by product","index":3,"n_rows":103,"n_cols":35,"rows_kept":103,"cut":false,"hidden":false,"merged":[[51,2,51,3],[102,2,102,3],[1,1,1,6]]}
["H"]
[null,"Time series of net benefits from  investments"]
[null,null,"Time period",{"$f":"'Product benefit & adoption'!G4","v":"ALL"}]
[null,"Item","Product Category","Product (value proposition, extension program etc)",{"$f":"\"SUM Period (non PV):\"&\" \"&TEXT('Product benefit & adoption'!$G$4,2)","v":"SUM Period (non PV): ALL"},"2015-16","2016-17","2017-18","2018-19","2019-20","2020-21","2021-22","2022-23","2023-24","2024-25","2025-26","2026-27","2027-28","2028-29","2029-30","2030-31","2031-32","2032-33","2033-34","2034-35","2035-36","2036-37","2037-38","2038-39","2039-40","2040-41","2041-42","2042-43","2043-44","2044-45"]
[null,null,null,null,"$m","$m","$m","$m","$m","$m","$m","$m","$m","$m","$m","$m","$m","$m","$m","$m","$m","$m","$m","$m","$m","$m","$m","$m","$m","$m","$m","$m","$m","$m","$m"]
[null,1,{"$f":"IF('Product benefit & adoption'!D11=\"\",\"\",'Product benefit & adoption'!D11)","v":"Pasture variety"},{"$f":"IF('Product benefit & adoption'!F11=\"\",\"\",'Product benefit & adoption'!F11)","v":"e.g Tropical pastures into  temperate zone\n\n"},{"$f":"_xlfn.IFS('Product benefit & adoption'!$G$4=\"ALL\",SUM(F6:AI6),'Product benefit & adoption'!$G$4=\"2020-25\",SUM(K6:AI6),'Product benefit & adoption'!$G$4=\"2015-20\",SUM(F6:AD6))","v":10.899999999999999},{"$f":"_xlfn.IFS('Product benefit & adoption'!$G$4=\"ALL\",'Product benefit & adoption'!AA11*'Product benefit & adoption'!$P11/1000000,'Product benefit & adoption'!$G$4=\"2020-25\",'Product benefit & adoption'!AA11*'Product benefit & adoption'!$N11/1000000,'Product benefit & adoption'!$G$4=\"2015-20\",'Product benefit & adoption'!AA11*'Product benefit & adoption'!$L11/1000000)","v":0},{"$f":"_xlfn.IFS('Product benefit & adoption'!$G$4=\"ALL\",'Product benefit & adoption'!AB11*'Product benefit & adoption'!$P11/1000000,'Product benefit & adoption'!$G$4=\"2020-25\",'Product benefit & adoption'!AB11*'Product benefit & adoption'!$N11/1000000,'Product benefit & adoption'!$G$4=\"2015-20\",'Product benefit & adoption'!AB11*'Product benefit & adoption'!$L11/1000000)","v":0},{"$f":"_xlfn.IFS('Product benefit & adoption'!$G$4=\"ALL\",'Product benefit & adoption'!AC11*'Product benefit & adoption'!$P11/1000000,'Product benefit & adoption'!$G$4=\"2020-25\",'Product benefit & adoption'!AC11*'Product benefit & adoption'!$N11/1000000,'Product benefit & adoption'!$G$4=\"2015-20\",'Product benefit & adoption'!AC11*'Product benefit & adoption'!$L11/1000000)","v":0},{"$f":"_xlfn.IFS('Product benefit & adoption'!$G$4=\"ALL\",'Product benefit & adoption'!AD11*'Product benefit & adoption'!$P11/1000000,'Product benefit & adoption'!$G$4=\"2020-25\",'Product benefit & adoption'!AD11*'Product benefit & adoption'!$N11/1000000,'Product benefit & adoption'!$G$4=\"2015-20\",'Product benefit & adoption'!AD11*'Product benefit & adoption'!$L11/1000000)","v":0},{"$f":"_xlfn.IFS('Product benefit & adoption'!$G$4=\"ALL\",'Product benefit & adoption'!AE11*'Product benefit & adoption'!$P11/1000000,'Product benefit & adoption'!$G$4=\"2020-25\",'Product benefit & adoption'!AE11*'Product benefit & adoption'!$N11/1000000,'Product benefit & adoption'!$G$4=\"2015-20\",'Product benefit & adoption'!AE11*'Product benefit & adoption'!$L11/1000000)","v":0},{"$f":"_xlfn.IFS('Product benefit & adoption'!$G$4=\"ALL\",'Product benefit & adoption'!AF11*'Product benefit & adoption'!$P11/1000000,'Product benefit & adoption'!$G$4=\"2020-25\",'Product benefit & adoption'!AF11*'Product benefit & adoption'!$N11/1000000,'Product benefit & adoption'!$G$4=\"2015-20\",'Product benefit & adoption'!AF11*'Product benefit & adoption'!$L11/1000000)","v":0.1},{"$f":"_xlfn.IFS('Product benefit & adoption'!$G$4=\"ALL\",'Product benefit & adoption'!AG11*'Product benefit & adoption'!$P11/1000000,'Product benefit & adoption'!$G$4=\"2020-25\",'Product benefit & adoption'!AG11*'Product benefit & adoption'!$N11/1000000,'Product benefit & adoption'!$G$4=\"2015-20\",'Product benefit & adoption'!AG11*'Product benefit & adoption'!$L11/1000000)","v":0.1},{"$f":"_xlfn.IFS('Product benefit & adoption'!$G$4=\"ALL\",'Product benefit & adoption'!AH11*'Product benefit & adoption'!$P11/1000000,'Product benefit & adoption'!$G$4=\"2020-25\",'Product benefit & adoption'!AH11*'Product benefit & adoption'!$N11/1000000,'Product benefit & adoption'!$G$4=\"2015-20\",'Product benefit & adoption'!AH11*'Product benefit & adoption'!$L11/1000000)","v":0.2},{"$f":"_xlfn.IFS('Product benefit & adoption'!$G$4=\"ALL\",'Product benefit & adoption'!AI11*'Product benefit & adoption'!$P11/1000000,'Product benefit & adoption'!$G$4=\"2020-25\",'Product benefit & adoption'!AI11*'Product benefit & adoption'!$N11/1000000,'Product benefit & adoption'!$G$4=\"2015-20\",'Product benefit & adoption'!AI11*'Product benefit & adoption'!$L11/1000000)","v":0.3},{"$f":"_xlfn.IFS('Product benefit & adoption'!$G$4=\"ALL\",'Product benefit & adoption'!AJ11*'Product benefit & adoption'!$P11/1000000,'Product benefit & adoption'!$G$4=\"2020-25\",'Product benefit & adoption'!AJ11*'Product benefit & adoption'!$N11/1000000,'Product benefit & adoption'!$G$4=\"2015-20\",'Product benefit & adoption'!AJ11*'Product benefit & adoption'!$L11/1000000)","v":0.5},{"$f":"_xlfn.IFS('Product benefit & adoption'!$G$4=\"ALL\",'Product benefit & adoption'!AK11*'Product benefit & adoption'!$P11/1000000,'Product benefit & adoption'!$G$4=\"2020-25\",'Product benefit & adoption'!AK11*'Product benefit & adoption'!$N11/1000000,'Product benefit & adoption'!$G$4=\"2015-20\",'Product benefit & adoption'!AK11*'Product benefit & adoption'!$L11/1000000)","v":0.7},{"$f":"_xlfn.IFS('Product benefit & adoption'!$G$4=\"ALL\",'Product benefit & adoption'!AL11*'Product benefit & adoption'!$P11/1000000,'Product benefit & adoption'!$G$4=\"2020-25\",'Product benefit & adoption'!AL11*'Product benefit & adoption'!$N11/1000000,'Product benefit & adoption'!$G$4=\"2015-20\",'Product benefit & adoption'!AL11*'Product benefit & adoption'!$L11/1000000)","v":1},{"$f":"_xlfn.IFS('Product benefit & adoption'!$G$4=\"ALL\",'Product benefit & adoption'!AM11*'Product benefit & adoption'!$P11/1000000,'Product benefit & adoption'!$G$4=\"2020-25\",'Product benefit & adoption'!AM11*'Product benefit & adoption'!$N11/1000000,'Product benefit & adoption'!$G$4=\"2015-20\",'Product benefit & adoption'!AM11*'Product benefit & adoption'!$L11/1000000)","v":1},{"$f":"_xlfn.IFS('Product benefit & adoption'!$G$4=\"ALL\",'Product benefit & adoption'!AN11*'Product benefit & adoption'!$P11/1000000,'Product benefit & adoption'!$G$4=\"2020-25\",'Product benefit & adoption'!AN11*'Product benefit & adoption'!$N11/1000000,'Product benefit & adoption'!$G$4=\"2015-20\",'Product benefit & adoption'!AN11*'Product benefit & adoption'!$L11/1000000)","v":0.9},{"$f":"_xlfn.IFS('Product benefit & adoption'!$G$4=\"ALL\",'Product benefit & adoption'!AO11*'Product benefit & adoption'!$P11/1000000,'Product benefit & adoption'!$G$4=\"2020-25\",'Product benefit & adoption'!AO11*'Product benefit & adoption'!$N11/1000000,'Product benefit & adoption'!$G$4=\"2015-20\",'Product benefit & adoption'!AO11*'Product benefit & adoption'!$L11/1000000)","v":0.8},{"$f":"_xlfn.IFS('Product benefit & adoption'!$G$4=\"ALL\",'Product benefit & adoption'!AP11*'Product benefit & adoption'!$P11/1000000,'Product benefit & adoption'!$G$4=\"2020-25\",'Product benefit & adoption'!AP11*'Product benefit & adoption'!$N11/1000000,'Product benefit & adoption'!$G$4=\"2015-20\",'Product benefit & adoption'!AP11*'Product benefit & adoption'!$L11/1000000)","v":0.7},{"$f":"_xlfn.IFS('Product benefit & adoption'!$G$4=\"ALL\",'Product benefit & adoption'!AQ11*'Product benefit & adoption'!$P11/1000000,'Product benefit & adoption'!$G$4=\"2020-25\",'Product benefit & adoption'!AQ11*'Product benefit & adoption'!$N11/1000000,'Product benefit & adoption'!$G$4=\"2015-20\",'Product benefit & adoption'!AQ11*'Product benefit & adoption'!$L11/1000000)","v":0.6},{"$f":"_xlfn.IFS('Product benefit & adoption'!$G$4=\"ALL\",'Product benefit & adoption'!AR11*'Product benefit & adoption'!$P11/1000000,'Product benefit & adoption'!$G$4=\"2020-25\",'Product benefit & adoption'!AR11*'Product benefit & adoption'!$N11/1000000,'Product benefit & adoption'!$G$4=\"2015-20\",'Product benefit & adoption'!AR11*'Product benefit & adoption'!$L11/1000000)","v":0.5},{"$f":"_xlfn.IFS('Product benefit & adoption'!$G$4=\"ALL\",'Product benefit & adoption'!AS11*'Product benefit & adoption'!$P11/1000000,'Product benefit & adoption'!$G$4=\"2020-25\",'Product benefit & adoption'!AS11*'Product benefit & adoption'!$N11/1000000,'Product benefit & adoption'!$G$4=\"2015-20\",'Product benefit & adoption'!AS11*'Product benefit & adoption'!$L11/1000000)","v":0.5},{"$f":"_xlfn.IFS('Product benefit & adoption'!$G$4=\"ALL\",'Product benefit & adoption'!AT11*'Product benefit & adoption'!$P11/1000000,'Product benefit & adoption'!$G$4=\"2020-25\",'Product benefit & adoption'!AT11*'Product benefit & adoption'!$N11/1000000,'Product benefit & adoption'!$G$4=\"2015-20\",'Product benefit & adoption'!AT11*'Product benefit & adoption'!$L11/1000000)","v":0.5},{"$f":"_xlfn.IFS('Product benefit & adoption'!$G$4=\"ALL\",'Product benefit & adoption'!AU11*'Product benefit & adoption'!$P11/1000000,'Product benefit & adoption'!$G$4=\"2020-25\",'Product benefit & adoption'!AU11*'Product benefit & adoption'!$N11/1000000,'Product benefit & adoption'!$G$4=\"2015-20\",'Product benefit & adoption'!AU11*'Product benefit & adoption'!$L11/1000000)","v":0.5},{"$f":"_xlfn.IFS('Product benefit & adoption'!$G$4=\"ALL\",'Product benefit & adoption'!AV11*'Product benefit & adoption'!$P11/1000000,'Product benefit & adoption'!$G$4=\"2020-25\",'Product benefit & adoption'!AV11*'Product benefit & adoption'!$N11/1000000,'Product benefit & adoption'!$G$4=\"2015-20\",'Product benefit & adoption'!AV11*'Product benefit & adoption'!$L11/1000000)","v":0.5},{"$f":"_xlfn.IFS('Product benefit & adoption'!$G$4=\"ALL\",'Product benefit & adoption'!AW11*'Product benefit & adoption'!$P11/1000000,'Product benefit & adoption'!$G$4=\"2020-25\",'Product benefit & adoption'!AW11*'Product benefit & adoption'!$N11/1000000,'Product benefit & adoption'!$G$4=\"2015-20\",'Product benefit & adoption'!AW11*'Product benefit & adoption'!$L11/1000000)","v":0.5},{"$f":"_xlfn.IFS('Product benefit & adoption'!$G$4=\"ALL\",'Product benefit & adoption'!AX11*'Product benefit & adoption'!$P11/1000000,'Product benefit & adoption'!$G$4=\"2020-25\",'Product benefit & adoption'!AX11*'Product benefit & adoption'!$N11/1000000,'Product benefit & adoption'!$G$4=\"2015-20\",'Product benefit & adoption'!AX11*'Product benefit & adoption'!$L11/1000000)","v":0.5},{"$f":"_xlfn.IFS('Product benefit & adoption'!$G$4=\"ALL\",'Product benefit & adoption'!AY11*'Product benefit & adoption'!$P11/1000000,'Product benefit & adoption'!$G$4=\"2020-25\",'Product benefit & adoption'!AY11*'Product benefit & adoption'!$N11/1000000,'Product benefit & adoption'!$G$4=\"2015-20\",'Product benefit & adoption'!AY11*'Product benefit & adoption'!$L11/1000000)","v":0.5},{"$f":"_xlfn.IFS('Product benefit & adoption'!$G$4=\"ALL\",'Product benefit & adoption'!AZ11*'Product benefit & adoption'!$P11/1000000,'Product benefit & adoption'!$G$4=\"2020-25\",'Product benefit & adoption'!AZ11*'Product benefit & adoption'!$N11/1000000,'Product benefit & adoption'!$G$4=\"2015-20\",'Product benefit & adoption'!AZ11*'Product benefit & adoption'!$L11/1000000)","v":0},{"$f":"_xlfn.IFS('Product benefit & adoption'!$G$4=\"ALL\",'Product benefit & adoption'!BA11*'Product benefit & adoption'!$P11/1000000,'Product benefit & adoption'!$G$4=\"2020-25\",'Product benefit & adoption'!BA11*'Product benefit & adoption'!$N11/1000000,'Product benefit & adoption'!$G$4=\"2015-20\",'Product benefit & adoption'!BA11*'Product benefit & adoption'!$L11/1000000)","v":0},{"$f":"_xlfn.IFS('Product benefit & adoption'!$G$4=\"ALL\",'Product benefit & adoption'!BB11*'Product benefit & adoption'!$P11/1000000,'Product benefit & adoption'!$G$4=\"2020-25\",'Product benefit & adoption'!BB11*'Product benefit & adoption'!$N11/1000000,'Product benefit & adoption'!$G$4=\"2015-20\",'Product benefit & adoption'!BB11*'Product benefit & adoption'!$L11/1000000)","v":0},{"$f":"_xlfn.IFS('Product benefit & adoption'!$G$4=\"ALL\",'Product benefit & adoption'!BC11*'Product benefit & adoption'!$P11/1000000,'Product benefit & adoption'!$G$4=\"2020-25\",'Product benefit & adoption'!BC11*'Product benefit & adoption'!$N11/1000000,'Product benefit & adoption'!$G$4=\"2015-20\",'Product benefit & adoption'!BC11*'Product benefit & adoption'!$L11/1000000)","v":0},{"$f":"_xlfn.IFS('Product benefit & adoption'!$G$4=\"ALL\",'Product benefit & adoption'!BD11*'Product benefit & adoption'!$P11/1000000,'Product benefit & adoption'!$G$4=\"2020-25\",'Product benefit & adoption'!BD11*'Product benefit & adoption'!$N11/1000000,'Product benefit & adoption'!$G$4=\"2015-20\",'Product benefit & adoption'!BD11*'Product benefit & adoption'!$L11/1000000)","v":0}]
[null,2,{"$f":"IF('Product benefit & adoption'!D12=\"\",\"\",'Product benefit & adoption'!D12)","v":"Reproductive efficiency"},{"$f":"IF('Product benefit & adoption'!F12=\"\",\"\",'Product benefit & adoption'!F12)","v":"e.g. Calf survival/weaning productivity tools, practices and extension program"},{"$f":"_xlfn.IFS('Product benefit & adoption'!$G$4=\"ALL\",SUM(F7:AI7),'Product benefit & adoption'!$G$4=\"2020-25\",SUM(K7:AI7),'Product benefit & adoption'!$G$4=\"2015-20\",SUM(F7:AD7))","v":269.2},{"$f":"_xlfn.IFS('Product benefit & adoption'!$G$4=\"ALL\",'Product benefit & adoption'!AA12*'Product benefit & adoption'!$P12/1000000,'Product benefit & adoption'!$G$4=\"2020-25\",'Product benefit & adoption'!AA12*'Product benefit & adoption'!$N12/1000000,'Product benefit & adoption'!$G$4=\"2015-20\",'Product benefit & adoption'!AA12*'Product benefit & adoption'!$L12/1000000)","v":0},{"$f":"_xlfn.IFS('Product benefit & adoption'!$G$4=\"ALL\",'Product benefit & adoption'!AB12*'Product benefit & adoption'!$P12/1000000,'Product benefit & adoption'!$G$4=\"2020-25\",'Product benefit & adoption'!AB12*'Product benefit & adoption'!$N12/1000000,'Product benefit & adoption'!$G$4=\"2015-20\",'Product benefit & adoption'!AB12*'Product benefit & adoption'!$L12/1000000)","v":0},{"$f":"_xlfn.IFS('Product benefit & adoption'!$G$4=\"ALL\",'Product benefit & adoption'!AC12*'Product benefit & adoption'!$P12/1000000,'Product benefit & adoption'!$G$4=\"2020-25\",'Product benefit & adoption'!AC12*'Product benefit & adoption'!$N12/1000000,'Product benefit & adoption'!$G$4=\"2015-20\",'Product benefit & adoption'!AC12*'Product benefit & adoption'!$L12/1000000)","v":0},{"$f":"_xlfn.IFS('Product benefit & adoption'!$G$4=\"ALL\",'Product benefit & adoption'!AD12*'Product benefit & adoption'!$P12/1000000,'Product benefit & adoption'!$G$4=\"2020-25\",'Product benefit & adoption'!AD12*'Product benefit & adoption'!$N12/1000000,'Product benefit & adoption'!$G$4=\"2015-20\",'Product benefit & adoption'!AD12*'Product benefit & adoption'!$L12/1000000)","v":0},{"$f":"_xlfn.IFS('Product benefit & adoption'!$G$4=\"ALL\",'Product benefit & adoption'!AE12*'Product benefit & adoption'!$P12/1000000,'Product benefit & adoption'!$G$4=\"2020-25\",'Product benefit & adoption'!AE12*'Product benefit & adoption'!$N12/1000000,'Product benefit & adoption'!$G$4=\"2015-20\",'Product benefit & adoption'!AE12*'Product benefit & adoption'!$L12/1000000)","v":0},{"$f":"_xlfn.IFS('Product benefit & adoption'!$G$4=\"ALL\",'Product benefit & adoption'!AF12*'Product benefit & adoption'!$P12/1000000,'Product benefit & adoption'!$G$4=\"2020-25\",'Product benefit & adoption'!AF12*'Product benefit & adoption'!$N12/1000000,'Product benefit & adoption'!$G$4=\"2015-20\",'Product benefit & adoption'!AF12*'Product benefit & adoption'!$L12/1000000)","v":0.2},{"$f":"_xlfn.IFS('Product benefit & adoption'!$G$4=\"ALL\",'Product benefit & adoption'!AG12*'Product benefit & adoption'!$P12/1000000,'Product benefit & adoption'!$G$4=\"2020-25\",'Product benefit & adoption'!AG12*'Product benefit & adoption'!$N12/1000000,'Product benefit & adoption'!$G$4=\"2015-20\",'Product benefit & adoption'!AG12*'Product benefit & adoption'!$L12/1000000)","v":1},{"$f":"_xlfn.IFS('Product benefit & adoption'!$G$4=\"ALL\",'Product benefit & adoption'!AH12*'Product benefit & adoption'!$P12/1000000,'Product benefit & adoption'!$G$4=\"2020-25\",'Product benefit & adoption'!AH12*'Product benefit & adoption'!$N12/1000000,'Product benefit & adoption'!$G$4=\"2015-20\",'Product benefit & adoption'!AH12*'Product benefit & adoption'!$L12/1000000)","v":2},{"$f":"_xlfn.IFS('Product benefit & adoption'!$G$4=\"ALL\",'Product benefit & adoption'!AI12*'Product benefit & adoption'!$P12/1000000,'Product benefit & adoption'!$G$4=\"2020-25\",'Product benefit & adoption'!AI12*'Product benefit & adoption'!$N12/1000000,'Product benefit & adoption'!$G$4=\"2015-20\",'Product benefit & adoption'!AI12*'Product benefit & adoption'!$L12/1000000)","v":5},{"$f":"_xlfn.IFS('Product benefit & adoption'!$G$4=\"ALL\",'Product benefit & adoption'!AJ12*'Product benefit & adoption'!$P12/1000000,'Product benefit & adoption'!$G$4=\"2020-25\",'Product benefit & adoption'!AJ12*'Product benefit & adoption'!$N12/1000000,'Product benefit & adoption'!$G$4=\"2015-20\",'Product benefit & adoption'!AJ12*'Product benefit & adoption'!$L12/1000000)","v":5},{"$f":"_xlfn.IFS('Product benefit & adoption'!$G$4=\"ALL\",'Product benefit & adoption'!AK12*'Product benefit & adoption'!$P12/1000000,'Product benefit & adoption'!$G$4=\"2020-25\",'Product benefit & adoption'!AK12*'Product benefit & adoption'!$N12/1000000,'Product benefit & adoption'!$G$4=\"2015-20\",'Product benefit & adoption'!AK12*'Product benefit & adoption'!$L12/1000000)","v":5},{"$f":"_xlfn.IFS('Product benefit & adoption'!$G$4=\"ALL\",'Product benefit & adoption'!AL12*'Product benefit & adoption'!$P12/1000000,'Product benefit & adoption'!$G$4=\"2020-25\",'Product benefit & adoption'!AL12*'Product benefit & adoption'!$N12/1000000,'Product benefit & adoption'!$G$4=\"2015-20\",'Product benefit & adoption'!AL12*'Product benefit & adoption'!$L12/1000000)","v":5},{"$f":"_xlfn.IFS('Product benefit & adoption'!$G$4=\"ALL\",'Product benefit & adoption'!AM12*'Product benefit & adoption'!$P12/1000000,'Product benefit & adoption'!$G$4=\"2020-25\",'Product benefit & adoption'!AM12*'Product benefit & adoption'!$N12/1000000,'Product benefit & adoption'!$G$4=\"2015-20\",'Product benefit & adoption'!AM12*'Product benefit & adoption'!$L12/1000000)","v":6},{"$f":"_xlfn.IFS('Product benefit & adoption'!$G$4=\"ALL\",'Product benefit & adoption'!AN12*'Product benefit & adoption'!$P12/1000000,'Product benefit & adoption'!$G$4=\"2020-25\",'Product benefit & adoption'!AN12*'Product benefit & adoption'!$N12/1000000,'Product benefit & adoption'!$G$4=\"2015-20\",'Product benefit & adoption'!AN12*'Product benefit & adoption'!$L12/1000000)","v":7},{"$f":"_xlfn.IFS('Product benefit & adoption'!$G$4=\"ALL\",'Product benefit & adoption'!AO12*'Product benefit & adoption'!$P12/1000000,'Product benefit & adoption'!$G$4=\"2020-25\",'Product benefit & adoption'!AO12*'Product benefit & adoption'!$N12/1000000,'Product benefit & adoption'!$G$4=\"2015-20\",'Product benefit & adoption'!AO12*'Product benefit & adoption'!$L12/1000000)","v":8},{"$f":"_xlfn.IFS('Product benefit & adoption'!$G$4=\"ALL\",'Product benefit & adoption'!AP12*'Product benefit & adoption'!$P12/1000000,'Product benefit & adoption'!$G$4=\"2020-25\",'Product benefit & adoption'!AP12*'Product benefit & adoption'!$N12/1000000,'Product benefit & adoption'!$G$4=\"2015-20\",'Product benefit & adoption'!AP12*'Product benefit & adoption'!$L12/1000000)","v":9},{"$f":"_xlfn.IFS('Product benefit & adoption'!$G$4=\"ALL\",'Product benefit & adoption'!AQ12*'Product benefit & adoption'!$P12/1000000,'Product benefit & adoption'!$G$4=\"2020-25\",'Product benefit & adoption'!AQ12*'Product benefit & adoption'!$N12/1000000,'Product benefit & adoption'!$G$4=\"2015-20\",'Product benefit & adoption'!AQ12*'Product benefit & adoption'!$L12/1000000)","v":10},{"$f":"_xlfn.IFS('Product benefit & adoption'!$G$4=\"ALL\",'Product benefit & adoption'!AR12*'Product benefit & adoption'!$P12/1000000,'Product benefit & adoption'!$G$4=\"2020-25\",'Product benefit & adoption'!AR12*'Product benefit & adoption'!$N12/1000000,'Product benefit & adoption'!$G$4=\"2015-20\",'Product benefit & adoption'!AR12*'Product benefit & adoption'!$L12/1000000)","v":11},{"$f":"_xlfn.IFS('Product benefit & adoption'!$G$4=\"ALL\",'Product benefit & adoption'!AS12*'Product benefit & adoption'!$P12/1000000,'Product benefit & adoption'!$G$4=\"2020-25\",'Product benefit & adoption'!AS12*'Product benefit & adoption'!$N12/1000000,'Product benefit & adoption'!$G$4=\"2015-20\",'Product benefit & adoption'!AS12*'Product benefit & adoption'!$L12/1000000)","v":12},{"$f":"_xlfn.IFS('Product benefit & adoption'!$G$4=\"ALL\",'Product benefit & adoption'!AT12*'Product benefit & adoption'!$P12/1000000,'Product benefit & adoption'!$G$4=\"2020-25\",'Product benefit & adoption'!AT12*'Product benefit & adoption'!$N12/1000000,'Product benefit & adoption'!$G$4=\"2015-20\",'Product benefit & adoption'!AT12*'Product benefit & adoption'!$L12/1000000)","v":13},{"$f":"_xlfn.IFS('Product benefit & adoption'!$G$4=\"ALL\",'Product benefit & adoption'!AU12*'Product benefit & adoption'!$P12/1000000,'Product benefit & adoption'!$G$4=\"2020-25\",'Product benefit & adoption'!AU12*'Product benefit & adoption'!$N12/1000000,'Product benefit & adoption'!$G$4=\"2015-20\",'Product benefit & adoption'!AU12*'Product benefit & adoption'!$L12/1000000)","v":14},{"$f":"_xlfn.IFS('Product benefit & adoption'!$G$4=\"ALL\",'Product benefit & adoption'!AV12*'Product benefit & adoption'!$P12/1000000,'Product benefit & adoption'!$G$4=\"2020-25\",'Product benefit & adoption'!AV12*'Product benefit & adoption'!$N12/1000000,'Product benefit & adoption'!$G$4=\"2015-20\",'Product benefit & adoption'!AV12*'Product benefit & adoption'!$L12/1000000)","v":15},{"$f":"_xlfn.IFS('Product benefit & adoption'!$G$4=\"ALL\",'Product benefit & adoption'!AW12*'Product benefit & adoption'!$P12/1000000,'Product benefit & adoption'!$G$4=\"2020-25\",'Product benefit & adoption'!AW12*'Product benefit & adoption'!$N12/1000000,'Product benefit & adoption'!$G$4=\"2015-20\",'Product benefit & adoption'!AW12*'Product benefit & adoption'!$L12/1000000)","v":16},{"$f":"_xlfn.IFS('Product benefit & adoption'!$G$4=\"ALL\",'Product benefit & adoption'!AX12*'Product benefit & adoption'!$P12/1000000,'Product benefit & adoption'!$G$4=\"2020-25\",'Product benefit & adoption'!AX12*'Product benefit & adoption'!$N12/1000000,'Product benefit & adoption'!$G$4=\"2015-20\",'Product benefit & adoption'!AX12*'Product benefit & adoption'!$L12/1000000)","v":17},{"$f":"_xlfn.IFS('Product benefit & adoption'!$G$4=\"ALL\",'Product benefit & adoption'!AY12*'Product benefit & adoption'!$P12/1000000,'Product benefit & adoption'!$G$4=\"2020-25\",'Product benefit & adoption'!AY12*'Product benefit & adoption'!$N12/1000000,'Product benefit & adoption'!$G$4=\"2015-20\",'Product benefit & adoption'!AY12*'Product benefit & adoption'!$L12/1000000)","v":18},{"$f":"_xlfn.IFS('Product benefit & adoption'!$G$4=\"ALL\",'Product benefit & adoption'!AZ12*'Product benefit & adoption'!$P12/1000000,'Product benefit & adoption'!$G$4=\"2020-25\",'Product benefit & adoption'!AZ12*'Product benefit & adoption'!$N12/1000000,'Product benefit & adoption'!$G$4=\"2015-20\",'Product benefit & adoption'!AZ12*'Product benefit & adoption'!$L12/1000000)","v":18},{"$f":"_xlfn.IFS('Product benefit & adoption'!$G$4=\"ALL\",'Product benefit & adoption'!BA12*'Product benefit & adoption'!$P12/1000000,'Product benefit & adoption'!$G$4=\"2020-25\",'Product benefit & adoption'!BA12*'Product benefit & adoption'!$N12/1000000,'Product benefit & adoption'!$G$4=\"2015-20\",'Product benefit & adoption'!BA12*'Product benefit & adoption'!$L12/1000000)","v":18},{"$f":"_xlfn.IFS('Product benefit & adoption'!$G$4=\"ALL\",'Product benefit & adoption'!BB12*'Product benefit & adoption'!$P12/1000000,'Product benefit & adoption'!$G$4=\"2020-25\",'Product benefit & adoption'!BB12*'Product benefit & adoption'!$N12/1000000,'Product benefit & adoption'!$G$4=\"2015-20\",'Product benefit & adoption'!BB12*'Product benefit & adoption'!$L12/1000000)","v":18},{"$f":"_xlfn.IFS('Product benefit & adoption'!$G$4=\"ALL\",'Product benefit & adoption'!BC12*'Product benefit & adoption'!$P12/1000000,'Product benefit & adoption'!$G$4=\"2020-25\",'Product benefit & adoption'!BC12*'Product benefit & adoption'!$N12/1000000,'Product benefit & adoption'!$G$4=\"2015-20\",'Product benefit & adoption'!BC12*'Product benefit & adoption'!$L12/1000000)","v":18},{"$f":"_xlfn.IFS('Product benefit & adoption'!$G$4=\"ALL\",'Product benefit & adoption'!BD12*'Product benefit & adoption'!$P12/1000000,'Product benefit & adoption'!$G$4=\"2020-25\",'Product benefit & adoption'!BD12*'Product benefit & adoption'!$N12/1000000,'Product benefit & adoption'!$G$4=\"2015-20\",'Product benefit & adoption'!BD12*'Product benefit & adoption'!$L12/1000000)","v":18}]
[null,3,{"$f":"IF('Product benefit & adoption'!D13=\"\",\"\",'Product benefit & adoption'!D13)","v":""},{"$f":"IF('Product benefit & adoption'!F13=\"\",\"\",'Product benefit & adoption'!F13)","v":""},{"$f":"_xlfn.IFS('Product benefit & adoption'!$G$4=\"ALL\",SUM(F8:AI8),'Product benefit & adoption'!$G$4=\"2020-25\",SUM(K8:AI8),'Product benefit & adoption'!$G$4=\"2015-20\",SUM(F8:AD8))","v":0},{"$f":"_xlfn.IFS('Product benefit & adoption'!$G$4=\"ALL\",'Product benefit & adoption'!AA13*'Product benefit & adoption'!$P13/1000000,'Product benefit & adoption'!$G$4=\"2020-25\",'Product benefit & adoption'!AA13*'Product benefit & adoption'!$N13/1000000,'Product benefit & adoption'!$G$4=\"2015-20\",'Product benefit & adoption'!AA13*'Product benefit & adoption'!$L13/1000000)","v":0},{"$f":"_xlfn.IFS('Product benefit & adoption'!$G$4=\"ALL\",'Product benefit & adoption'!AB13*'Product benefit & adoption'!$P13/1000000,'Product benefit & adoption'!$G$4=\"2020-25\",'Product benefit & adoption'!AB13*'Product benefit & adoption'!$N13/1000000,'Product benefit & adoption'!$G$4=\"2015-20\",'Product benefit & adoption'!AB13*'Product benefit & adoption'!$L13/1000000)","v":0},{"$f":"_xlfn.IFS('Product benefit & adoption'!$G$4=\"ALL\",'Product benefit & adoption'!AC13*'Product benefit & adoption'!$P13/1000000,'Product benefit & adoption'!$G$4=\"2020-25\",'Product benefit & adoption'!AC13*'Product benefit & adoption'!$N13/1000000,'Product benefit & adoption'!$G$4=\"2015-20\",'Product benefit & adoption'!AC13*'Product benefit & adoption'!$L13/1000000)","v":0},{"$f":"_xlfn.IFS('Product benefit & adoption'!$G$4=\"ALL\",'Product benefit & adoption'!AD13*'Product benefit & adoption'!$P13/1000000,'Product benefit & adoption'!$G$4=\"2020-25\",'Product benefit & adoption'!AD13*'Product benefit & adoption'!$N13/1000000,'Product benefit & adoption'!$G$4=\"2015-20\",'Product benefit & adoption'!AD13*'Product benefit & adoption'!$L13/1000000)","v":0},{"$f":"_xlfn.IFS('Product benefit & adoption'!$G$4=\"ALL\",'Product benefit & adoption'!AE13*'Product benefit & adoption'!$P13/1000000,'Product benefit & adoption'!$G$4=\"2020-25\",'Product benefit & adoption'!AE13*'Product benefit & adoption'!$N13/1000000,'Product benefit & adoption'!$G$4=\"2015-20\",'Product benefit & adoption'!AE13*'Product benefit & adoption'!$L13/1000000)","v":0},{"$f":"_xlfn.IFS('Product benefit & adoption'!$G$4=\"ALL\",'Product benefit & adoption'!AF13*'Product benefit & adoption'!$P13/1000000,'Product benefit & adoption'!$G$4=\"2020-25\",'Product benefit & adoption'!AF13*'Product benefit & adoption'!$N13/1000000,'Product benefit & adoption'!$G$4=\"2015-20\",'Product benefit & adoption'!AF13*'Product benefit & adoption'!$L13/1000000)","v":0},{"$f":"_xlfn.IFS('Product benefit & adoption'!$G$4=\"ALL\",'Product benefit & adoption'!AG13*'Product benefit & adoption'!$P13/1000000,'Product benefit & adoption'!$G$4=\"2020-25\",'Product benefit & adoption'!AG13*'Product benefit & adoption'!$N13/1000000,'Product benefit & adoption'!$G$4=\"2015-20\",'Product benefit & adoption'!AG13*'Product benefit & adoption'!$L13/1000000)","v":0},{"$f":"_xlfn.IFS('Product benefit & adoption'!$G$4=\"ALL\",'Product benefit & adoption'!AH13*'Product benefit & adoption'!$P13/1000000,'Product benefit & adoption'!$G$4=\"2020-25\",'Product benefit & adoption'!AH13*'Product benefit & adoption'!$N13/1000000,'Product benefit & adoption'!$G$4=\"2015-20\",'Product benefit & adoption'!AH13*'Product benefit & adoption'!$L13/1000000)","v":0},{"$f":"_xlfn.IFS('Product benefit & adoption'!$G$4=\"ALL\",'Product benefit & adoption'!AI13*'Product benefit & adoption'!$P13/1000000,'Product benefit & adoption'!$G$4=\"2020-25\",'Product benefit & adoption'!AI13*'Product benefit & adoption'!$N13/1000000,'Product benefit & adoption'!$G$4=\"2015-20\",'Product benefit & adoption'!AI13*'Product benefit & adoption'!$L13/1000000)","v":0},{"$f":"_xlfn.IFS('Product benefit & adoption'!$G$4=\"ALL\",'Product benefit & adoption'!AJ13*'Product benefit & adoption'!$P13/1000000,'Product benefit & adoption'!$G$4=\"2020-25\",'Product benefit & adoption'!AJ13*'Product benefit & adoption'!$N13/1000000,'Product benefit & adoption'!$G$4=\"2015-20\",'Product benefit & adoption'!AJ13*'Product benefit & adoption'!$L13/1000000)","v":0},{"$f":"_xlfn.IFS('Product benefit & adoption'!$G$4=\"ALL\",'Product benefit & adoption'!AK13*'Product benefit & adoption'!$P13/1000000,'Product benefit & adoption'!$G$4=\"2020-25\",'Product benefit & adoption'!AK13*'Product benefit & adoption'!$N13/1000000,'Product benefit & adoption'!$G$4=\"2015-20\",'Product benefit & adoption'!AK13*'Product benefit & adoption'!$L13/1000000)","v":0},{"$f":"_xlfn.IFS('Product benefit & adoption'!$G$4=\"ALL\",'Product benefit & adoption'!AL13*'Product benefit & adoption'!$P13/1000000,'Product benefit & adoption'!$G$4=\"2020-25\",'Product benefit & adoption'!AL13*'Product benefit & adoption'!$N13/1000000,'Product benefit & adoption'!$G$4=\"2015-20\",'Product benefit & adoption'!AL13*'Product benefit & adoption'!$L13/1000000)","v":0},{"$f":"_xlfn.IFS('Product benefit & adoption'!$G$4=\"ALL\",'Product benefit & adoption'!AM13*'Product benefit & adoption'!$P13/1000000,'Product benefit & adoption'!$G$4=\"2020-25\",'Product benefit & adoption'!AM13*'Product benefit & adoption'!$N13/1000000,'Product benefit & adoption'!$G$4=\"2015-20\",'Product benefit & adoption'!AM13*'Product benefit & adoption'!$L13/1000000)","v":0},{"$f":"_xlfn.IFS('Product benefit & adoption'!$G$4=\"ALL\",'Product benefit & adoption'!AN13*'Product benefit & adoption'!$P13/1000000,'Product benefit & adoption'!$G$4=\"2020-25\",'Product benefit & adoption'!AN13*'Product benefit & adoption'!$N13/1000000,'Product benefit & adoption'!$G$4=\"2015-20\",'Product benefit & adoption'!AN13*'Product benefit & adoption'!$L13/1000000)","v":0},{"$f":"_xlfn.IFS('Product benefit & adoption'!$G$4=\"ALL\",'Product benefit & adoption'!AO13*'Product benefit & adoption'!$P13/1000000,'Product benefit & adoption'!$G$4=\"2020-25\",'Product benefit & adoption'!AO13*'Product benefit & adoption'!$N13/1000000,'Product benefit & adoption'!$G$4=\"2015-20\",'Product benefit & adoption'!AO13*'Product benefit & adoption'!$L13/1000000)","v":0},{"$f":"_xlfn.IFS('Product benefit & adoption'!$G$4=\"ALL\",'Product benefit & adoption'!AP13*'Product benefit & adoption'!$P13/1000000,'Product benefit & adoption'!$G$4=\"2020-25\",'Product benefit & adoption'!AP13*'Product benefit & adoption'!$N13/1000000,'Product benefit & adoption'!$G$4=\"2015-20\",'Product benefit & adoption'!AP13*'Product benefit & adoption'!$L13/1000000)","v":0},{"$f":"_xlfn.IFS('Product benefit & adoption'!$G$4=\"ALL\",'Product benefit & adoption'!AQ13*'Product benefit & adoption'!$P13/1000000,'Product benefit & adoption'!$G$4=\"2020-25\",'Product benefit & adoption'!AQ13*'Product benefit & adoption'!$N13/1000000,'Product benefit & adoption'!$G$4=\"2015-20\",'Product benefit & adoption'!AQ13*'Product benefit & adoption'!$L13/1000000)","v":0},{"$f":"_xlfn.IFS('Product benefit & adoption'!$G$4=\"ALL\",'Product benefit & adoption'!AR13*'Product benefit & adoption'!$P13/1000000,'Product benefit & adoption'!$G$4=\"2020-25\",'Product benefit & adoption'!AR13*'Product benefit & adoption'!$N13/1000000,'Product benefit & adoption'!$G$4=\"2015-20\",'Product benefit & adoption'!AR13*'Product benefit & adoption'!$L13/1000000)","v":0},{"$f":"_xlfn.IFS('Product benefit & adoption'!$G$4=\"ALL\",'Product benefit & adoption'!AS13*'Product benefit & adoption'!$P13/1000000,'Product benefit & adoption'!$G$4=\"2020-25\",'Product benefit & adoption'!AS13*'Product benefit & adoption'!$N13/1000000,'Product benefit & adoption'!$G$4=\"2015-20\",'Product benefit & adoption'!AS13*'Product benefit & adoption'!$L13/1000000)","v":0},{"$f":"_xlfn.IFS('Product benefit & adoption'!$G$4=\"ALL\",'Product benefit & adoption'!AT13*'Product benefit & adoption'!$P13/1000000,'Product benefit & adoption'!$G$4=\"2020-25\",'Product benefit & adoption'!AT13*'Product benefit & adoption'!$N13/1000000,'Product benefit & adoption'!$G$4=\"2015-20\",'Product benefit & adoption'!AT13*'Product benefit & adoption'!$L13/1000000)","v":0},{"$f":"_xlfn.IFS('Product benefit & adoption'!$G$4=\"ALL\",'Product benefit & adoption'!AU13*'Product benefit & adoption'!$P13/1000000,'Product benefit & adoption'!$G$4=\"2020-25\",'Product benefit & adoption'!AU13*'Product benefit & adoption'!$N13/1000000,'Product benefit & adoption'!$G$4=\"2015-20\",'Product benefit & adoption'!AU13*'Product benefit & adoption'!$L13/1000000)","v":0},{"$f":"_xlfn.IFS('Product benefit & adoption'!$G$4=\"ALL\",'Product benefit & adoption'!AV13*'Product benefit & adoption'!$P13/1000000,'Product benefit & adoption'!$G$4=\"2020-25\",'Product benefit & adoption'!AV13*'Product benefit & adoption'!$N13/1000000,'Product benefit & adoption'!$G$4=\"2015-20\",'Product benefit & adoption'!AV13*'Product benefit & adoption'!$L13/1000000)","v":0},{"$f":"_xlfn.IFS('Product benefit & adoption'!$G$4=\"ALL\",'Product benefit & adoption'!AW13*'Product benefit & adoption'!$P13/1000000,'Product benefit & adoption'!$G$4=\"2020-25\",'Product benefit & adoption'!AW13*'Product benefit & adoption'!$N13/1000000,'Product benefit & adoption'!$G$4=\"2015-20\",'Product benefit & adoption'!AW13*'Product benefit & adoption'!$L13/1000000)","v":0},{"$f":"_xlfn.IFS('Product benefit & adoption'!$G$4=\"ALL\",'Product benefit & adoption'!AX13*'Product benefit & adoption'!$P13/1000000,'Product benefit & adoption'!$G$4=\"2020-25\",'Product benefit & adoption'!AX13*'Product benefit & adoption'!$N13/1000000,'Product benefit & adoption'!$G$4=\"2015-20\",'Product benefit & adoption'!AX13*'Product benefit & adoption'!$L13/1000000)","v":0},{"$f":"_xlfn.IFS('Product benefit & adoption'!$G$4=\"ALL\",'Product benefit & adoption'!AY13*'Product benefit & adoption'!$P13/1000000,'Product benefit & adoption'!$G$4=\"2020-25\",'Product benefit & adoption'!AY13*'Product benefit & adoption'!$N13/1000000,'Product benefit & adoption'!$G$4=\"2015-20\",'Product benefit & adoption'!AY13*'Product benefit & adoption'!$L13/1000000)","v":0},{"$f":"_xlfn.IFS('Product benefit & adoption'!$G$4=\"ALL\",'Product benefit & adoption'!AZ13*'Product benefit & adoption'!$P13/1000000,'Product benefit & adoption'!$G$4=\"2020-25\",'Product benefit & adoption'!AZ13*'Product benefit & adoption'!$N13/1000000,'Product benefit & adoption'!$G$4=\"2015-20\",'Product benefit & adoption'!AZ13*'Product benefit & adoption'!$L13/1000000)","v":0},{"$f":"_xlfn.IFS('Product benefit & adoption'!$G$4=\"ALL\",'Product benefit & adoption'!BA13*'Product benefit & adoption'!$P13/1000000,'Product benefit & adoption'!$G$4=\"2020-25\",'Product benefit & adoption'!BA13*'Product benefit & adoption'!$N13/1000000,'Product benefit & adoption'!$G$4=\"2015-20\",'Product benefit & adoption'!BA13*'Product benefit & adoption'!$L13/1000000)","v":0},{"$f":"_xlfn.IFS('Product benefit & adoption'!$G$4=\"ALL\",'Product benefit & adoption'!BB13*'Product benefit & adoption'!$P13/1000000,'Product benefit & adoption'!$G$4=\"2020-25\",'Product benefit & adoption'!BB13*'Product benefit & adoption'!$N13/1000000,'Product benefit & adoption'!$G$4=\"2015-20\",'Product benefit & adoption'!BB13*'Product benefit & adoption'!$L13/1000000)","v":0},{"$f":"_xlfn.IFS('Product benefit & adoption'!$G$4=\"ALL\",'Product benefit & adoption'!BC13*'Product benefit & adoption'!$P13/1000000,'Product benefit & adoption'!$G$4=\"2020-25\",'Product benefit & adoption'!BC13*'Product benefit & adoption'!$N13/1000000,'Product benefit & adoption'!$G$4=\"2015-20\",'Product benefit & adoption'!BC13*'Product benefit & adoption'!$L13/1000000)","v":0},{"$f":"_xlfn.IFS('Product benefit & adoption'!$G$4=\"ALL\",'Product benefit & adoption'!BD13*'Product benefit & adoption'!$P13/1000000,'Product benefit & adoption'!$G$4=\"2020-25\",'Product benefit & adoption'!BD13*'Product benefit & adoption'!$N13/1000000,'Product benefit & adoption'!$G$4=\"2015-20\",'Product benefit & adoption'!BD13*'Product benefit & adoption'!$L13/1000000)","v":0}]
[null,4,{"$f":"IF('Product benefit & adoption'!D14=\"\",\"\",'Product benefit & adoption'!D14)","v":""},{"$f":"IF('Product benefit & adoption'!F14=\"\",\"\",'Product benefit & adoption'!F14)","v":""},{"$f":"SUM(F9:AI9)","v":0},{"$f":"_xlfn.IFS('Product benefit & adoption'!$G$4=\"ALL\",'Product benefit & adoption'!AA14*'Product benefit & adoption'!$P14/1000000,'Product benefit & adoption'!$G$4=\"2020-25\",'Product benefit & adoption'!AA14*'Product benefit & adoption'!$N14/1000000,'Product benefit & adoption'!$G$4=\"2015-20\",'Product benefit & adoption'!AA14*'Product benefit & adoption'!$L14/1000000)","v":0},{"$f":"_xlfn.IFS('Product benefit & adoption'!$G$4=\"ALL\",'Product benefit & adoption'!AB14*'Product benefit & adoption'!$P14/1000000,'Product benefit & adoption'!$G$4=\"2020-25\",'Product benefit & adoption'!AB14*'Product benefit & adoption'!$N14/1000000,'Product benefit & adoption'!$G$4=\"2015-20\",'Product benefit & adoption'!AB14*'Product benefit & adoption'!$L14/1000000)","v":0},{"$f":"_xlfn.IFS('Product benefit & adoption'!$G$4=\"ALL\",'Product benefit & adoption'!AC14*'Product benefit & adoption'!$P14/1000000,'Product benefit & adoption'!$G$4=\"2020-25\",'Product benefit & adoption'!AC14*'Product benefit & adoption'!$N14/1000000,'Product benefit & adoption'!$G$4=\"2015-20\",'Product benefit & adoption'!AC14*'Product benefit & adoption'!$L14/1000000)","v":0},{"$f":"_xlfn.IFS('Product benefit & adoption'!$G$4=\"ALL\",'Product benefit & adoption'!AD14*'Product benefit & adoption'!$P14/1000000,'Product benefit & adoption'!$G$4=\"2020-25\",'Product benefit & adoption'!AD14*'Product benefit & adoption'!$N14/1000000,'Product benefit & adoption'!$G$4=\"2015-20\",'Product benefit & adoption'!AD14*'Product benefit & adoption'!$L14/1000000)","v":0},{"$f":"_xlfn.IFS('Product benefit & adoption'!$G$4=\"ALL\",'Product benefit & adoption'!AE14*'Product benefit & adoption'!$P14/1000000,'Product benefit & adoption'!$G$4=\"2020-25\",'Product benefit & adoption'!AE14*'Product benefit & adoption'!$N14/1000000,'Product benefit & adoption'!$G$4=\"2015-20\",'Product benefit & adoption'!AE14*'Product benefit & adoption'!$L14/1000000)","v":0},{"$f":"_xlfn.IFS('Product benefit & adoption'!$G$4=\"ALL\",'Product benefit & adoption'!AF14*'Product benefit & adoption'!$P14/1000000,'Product benefit & adoption'!$G$4=\"2020-25\",'Product benefit & adoption'!AF14*'Product benefit & adoption'!$N14/1000000,'Product benefit & adoption'!$G$4=\"2015-20\",'Product benefit & adoption'!AF14*'Product benefit & adoption'!$L14/1000000)","v":0},{"$f":"_xlfn.IFS('Product benefit & adoption'!$G$4=\"ALL\",'Product benefit & adoption'!AG14*'Product benefit & adoption'!$P14/1000000,'Product benefit & adoption'!$G$4=\"2020-25\",'Product benefit & adoption'!AG14*'Product benefit & adoption'!$N14/1000000,'Product benefit & adoption'!$G$4=\"2015-20\",'Product benefit & adoption'!AG14*'Product benefit & adoption'!$L14/1000000)","v":0},{"$f":"_xlfn.IFS('Product benefit & adoption'!$G$4=\"ALL\",'Product benefit & adoption'!AH14*'Product benefit & adoption'!$P14/1000000,'Product benefit & adoption'!$G$4=\"2020-25\",'Product benefit & adoption'!AH14*'Product benefit & adoption'!$N14/1000000,'Product benefit & adoption'!$G$4=\"2015-20\",'Product benefit & adoption'!AH14*'Product benefit & adoption'!$L14/1000000)","v":0},{"$f":"_xlfn.IFS('Product benefit & adoption'!$G$4=\"ALL\",'Product benefit & adoption'!AI14*'Product benefit & adoption'!$P14/1000000,'Product benefit & adoption'!$G$4=\"2020-25\",'Product benefit & adoption'!AI14*'Product benefit & adoption'!$N14/1000000,'Product benefit & adoption'!$G$4=\"2015-20\",'Product benefit & adoption'!AI14*'Product benefit & adoption'!$L14/1000000)","v":0},{"$f":"_xlfn.IFS('Product benefit & adoption'!$G$4=\"ALL\",'Product benefit & adoption'!AJ14*'Product benefit & adoption'!$P14/1000000,'Product benefit & adoption'!$G$4=\"2020-25\",'Product benefit & adoption'!AJ14*'Product benefit & adoption'!$N14/1000000,'Product benefit & adoption'!$G$4=\"2015-20\",'Product benefit & adoption'!AJ14*'Product benefit & adoption'!$L14/1000000)","v":0},{"$f":"_xlfn.IFS('Product benefit & adoption'!$G$4=\"ALL\",'Product benefit & adoption'!AK14*'Product benefit & adoption'!$P14/1000000,'Product benefit & adoption'!$G$4=\"2020-25\",'Product benefit & adoption'!AK14*'Product benefit & adoption'!$N14/1000000,'Product benefit & adoption'!$G$4=\"2015-20\",'Product benefit & adoption'!AK14*'Product benefit & adoption'!$L14/1000000)","v":0},{"$f":"_xlfn.IFS('Product benefit & adoption'!$G$4=\"ALL\",'Product benefit & adoption'!AL14*'Product benefit & adoption'!$P14/1000000,'Product benefit & adoption'!$G$4=\"2020-25\",'Product benefit & adoption'!AL14*'Product benefit & adoption'!$N14/1000000,'Product benefit & adoption'!$G$4=\"2015-20\",'Product benefit & adoption'!AL14*'Product benefit & adoption'!$L14/1000000)","v":0},{"$f":"_xlfn.IFS('Product benefit & adoption'!$G$4=\"ALL\",'Product benefit & adoption'!AM14*'Product benefit & adoption'!$P14/1000000,'Product benefit & adoption'!$G$4=\"2020-25\",'Product benefit & adoption'!AM14*'Product benefit & adoption'!$N14/1000000,'Product benefit & adoption'!$G$4=\"2015-20\",'Product benefit & adoption'!AM14*'Product benefit & adoption'!$L14/1000000)","v":0},{"$f":"_xlfn.IFS('Product benefit & adoption'!$G$4=\"ALL\",'Product benefit & adoption'!AN14*'Product benefit & adoption'!$P14/1000000,'Product benefit & adoption'!$G$4=\"2020-25\",'Product benefit & adoption'!AN14*'Product benefit & adoption'!$N14/1000000,'Product benefit & adoption'!$G$4=\"2015-20\",'Product benefit & adoption'!AN14*'Product benefit & adoption'!$L14/1000000)","v":0},{"$f":"_xlfn.IFS('Product benefit & adoption'!$G$4=\"ALL\",'Product benefit & adoption'!AO14*'Product benefit & adoption'!$P14/1000000,'Product benefit & adoption'!$G$4=\"2020-25\",'Product benefit & adoption'!AO14*'Product benefit & adoption'!$N14/1000000,'Product benefit & adoption'!$G$4=\"2015-20\",'Product benefit & adoption'!AO14*'Product benefit & adoption'!$L14/1000000)","v":0},{"$f":"_xlfn.IFS('Product benefit & adoption'!$G$4=\"ALL\",'Product benefit & adoption'!AP14*'Product benefit & adoption'!$P14/1000000,'Product benefit & adoption'!$G$4=\"2020-25\",'Product benefit & adoption'!AP14*'Product benefit & adoption'!$N14/1000000,'Product benefit & adoption'!$G$4=\"2015-20\",'Product benefit & adoption'!AP14*'Product benefit & adoption'!$L14/1000000)","v":0},{"$f":"_xlfn.IFS('Product benefit & adoption'!$G$4=\"ALL\",'Product benefit & adoption'!AQ14*'Product benefit & adoption'!$P14/1000000,'Product benefit & adoption'!$G$4=\"2020-25\",'Product benefit & adoption'!AQ14*'Product benefit & adoption'!$N14/1000000,'Product benefit & adoption'!$G$4=\"2015-20\",'Product benefit & adoption'!AQ14*'Product benefit & adoption'!$L14/1000000)","v":0},{"$f":"_xlfn.IFS('Product benefit & adoption'!$G$4=\"ALL\",'Product benefit & adoption'!AR14*'Product benefit & adoption'!$P14/1000000,'Product benefit & adoption'!$G$4=\"2020-25\",'Product benefit & adoption'!AR14*'Product benefit & adoption'!$N14/1000000,'Product benefit & adoption'!$G$4=\"2015-20\",'Product benefit & adoption'!AR14*'Product benefit & adoption'!$L14/1000000)","v":0},{"$f":"_xlfn.IFS('Product benefit & adoption'!$G$4=\"ALL\",'Product benefit & adoption'!AS14*'Product benefit & adoption'!$P14/1000000,'Product benefit & adoption'!$G$4=\"2020-25\",'Product benefit & adoption'!AS14*'Product benefit & adoption'!$N14/1000000,'Product benefit & adoption'!$G$4=\"2015-20\",'Product benefit & adoption'!AS14*'Product benefit & adoption'!$L14/1000000)","v":0},{"$f":"_xlfn.IFS('Product benefit & adoption'!$G$4=\"ALL\",'Product benefit & adoption'!AT14*'Product benefit & adoption'!$P14/1000000,'Product benefit & adoption'!$G$4=\"2020-25\",'Product benefit & adoption'!AT14*'Product benefit & adoption'!$N14/1000000,'Product benefit & adoption'!$G$4=\"2015-20\",'Product benefit & adoption'!AT14*'Product benefit & adoption'!$L14/1000000)","v":0},{"$f":"_xlfn.IFS('Product benefit & adoption'!$G$4=\"ALL\",'Product benefit & adoption'!AU14*'Product benefit & adoption'!$P14/1000000,'Product benefit & adoption'!$G$4=\"2020-25\",'Product benefit & adoption'!AU14*'Product benefit & adoption'!$N14/1000000,'Product benefit & adoption'!$G$4=\"2015-20\",'Product benefit & adoption'!AU14*'Product benefit & adoption'!$L14/1000000)","v":0},{"$f":"_xlfn.IFS('Product benefit & adoption'!$G$4=\"ALL\",'Product benefit & adoption'!AV14*'Product benefit & adoption'!$P14/1000000,'Product benefit & adoption'!$G$4=\"2020-25\",'Product benefit & adoption'!AV14*'Product benefit & adoption'!$N14/1000000,'Product benefit & adoption'!$G$4=\"2015-20\",'Product benefit & adoption'!AV14*'Product benefit & adoption'!$L14/1000000)","v":0},{"$f":"_xlfn.IFS('Product benefit & adoption'!$G$4=\"ALL\",'Product benefit & adoption'!AW14*'Product benefit & adoption'!$P14/1000000,'Product benefit & adoption'!$G$4=\"2020-25\",'Product benefit & adoption'!AW14*'Product benefit & adoption'!$N14/1000000,'Product benefit & adoption'!$G$4=\"2015-20\",'Product benefit & adoption'!AW14*'Product benefit & adoption'!$L14/1000000)","v":0},{"$f":"_xlfn.IFS('Product benefit & adoption'!$G$4=\"ALL\",'Product benefit & adoption'!AX14*'Product benefit & adoption'!$P14/1000000,'Product benefit & adoption'!$G$4=\"2020-25\",'Product benefit & adoption'!AX14*'Product benefit & adoption'!$N14/1000000,'Product benefit & adoption'!$G$4=\"2015-20\",'Product benefit & adoption'!AX14*'Product benefit & adoption'!$L14/1000000)","v":0},{"$f":"_xlfn.IFS('Product benefit & adoption'!$G$4=\"ALL\",'Product benefit & adoption'!AY14*'Product benefit & adoption'!$P14/1000000,'Product benefit & adoption'!$G$4=\"2020-25\",'Product benefit & adoption'!AY14*'Product benefit & adoption'!$N14/1000000,'Product benefit & adoption'!$G$4=\"2015-20\",'Product benefit & adoption'!AY14*'Product benefit & adoption'!$L14/1000000)","v":0},{"$f":"_xlfn.IFS('Product benefit & adoption'!$G$4=\"ALL\",'Product benefit & adoption'!AZ14*'Product benefit & adoption'!$P14/1000000,'Product benefit & adoption'!$G$4=\"2020-25\",'Product benefit & adoption'!AZ14*'Product benefit & adoption'!$N14/1000000,'Product benefit & adoption'!$G$4=\"2015-20\",'Product benefit & adoption'!AZ14*'Product benefit & adoption'!$L14/1000000)","v":0},{"$f":"_xlfn.IFS('Product benefit & adoption'!$G$4=\"ALL\",'Product benefit & adoption'!BA14*'Product benefit & adoption'!$P14/1000000,'Product benefit & adoption'!$G$4=\"2020-25\",'Product benefit & adoption'!BA14*'Product benefit & adoption'!$N14/1000000,'Product benefit & adoption'!$G$4=\"2015-20\",'Product benefit & adoption'!BA14*'Product benefit & adoption'!$L14/1000000)","v":0},{"$f":"_xlfn.IFS('Product benefit & adoption'!$G$4=\"ALL\",'Product benefit & adoption'!BB14*'Product benefit & adoption'!$P14/1000000,'Product benefit & adoption'!$G$4=\"2020-25\",'Product benefit & adoption'!BB14*'Product benefit & adoption'!$N14/1000000,'Product benefit & adoption'!$G$4=\"2015-20\",'Product benefit & adoption'!BB14*'Product benefit & adoption'!$L14/1000000)","v":0},{"$f":"_xlfn.IFS('Product benefit & adoption'!$G$4=\"ALL\",'Product benefit & adoption'!BC14*'Product benefit & adoption'!$P14/1000000,'Product benefit & adoption'!$G$4=\"2020-25\",'Product benefit & adoption'!BC14*'Product benefit & adoption'!$N14/1000000,'Product benefit & adoption'!$G$4=\"2015-20\",'Product benefit & adoption'!BC14*'Product benefit & adoption'!$L14/1000000)","v":0},{"$f":"_xlfn.IFS('Product benefit & adoption'!$G$4=\"ALL\",'Product benefit & adoption'!BD14*'Product benefit & adoption'!$P14/1000000,'Product benefit & adoption'!$G$4=\"2020-25\",'Product benefit & adoption'!BD14*'Product benefit & adoption'!$N14/1000000,'Product benefit & adoption'!$G$4=\"2015-20\",'Product benefit & adoption'!BD14*'Product benefit & adoption'!$L14/1000000)","v":0}]
[null,5,{"$f":"IF('Product benefit & adoption'!D15=\"\",\"\",'Product benefit & adoption'!D15)","v":""},{"$f":"IF('Product benefit & adoption'!F15=\"\",\"\",'Product benefit & adoption'!F15)","v":""},0,{"$f":"_xlfn.IFS('Product benefit & adoption'!$G$4=\"ALL\",'Product benefit & adoption'!AA15*'Product benefit & adoption'!$P15/1000000,'Product benefit & adoption'!$G$4=\"2020-25\",'Product benefit & adoption'!AA15*'Product benefit & adoption'!$N15/1000000,'Product benefit & adoption'!$G$4=\"2015-20\",'Product benefit & adoption'!AA15*'Product benefit & adoption'!$L15/1000000)","v":0},{"$f":"_xlfn.IFS('Product benefit & adoption'!$G$4=\"ALL\",'Product benefit & adoption'!AB15*'Product benefit & adoption'!$P15/1000000,'Product benefit & adoption'!$G$4=\"2020-25\",'Product benefit & adoption'!AB15*'Product benefit & adoption'!$N15/1000000,'Product benefit & adoption'!$G$4=\"2015-20\",'Product benefit & adoption'!AB15*'Product benefit & adoption'!$L15/1000000)","v":0},{"$f":"_xlfn.IFS('Product benefit & adoption'!$G$4=\"ALL\",'Product benefit & adoption'!AC15*'Product benefit & adoption'!$P15/1000000,'Product benefit & adoption'!$G$4=\"2020-25\",'Product benefit & adoption'!AC15*'Product benefit & adoption'!$N15/1000000,'Product benefit & adoption'!$G$4=\"2015-20\",'Product benefit & adoption'!AC15*'Product benefit & adoption'!$L15/1000000)","v":0},{"$f":"_xlfn.IFS('Product benefit & adoption'!$G$4=\"ALL\",'Product benefit & adoption'!AD15*'Product benefit & adoption'!$P15/1000000,'Product benefit & adoption'!$G$4=\"2020-25\",'Product benefit & adoption'!AD15*'Product benefit & adoption'!$N15/1000000,'Product benefit & adoption'!$G$4=\"2015-20\",'Product benefit & adoption'!AD15*'Product benefit & adoption'!$L15/1000000)","v":0},{"$f":"_xlfn.IFS('Product benefit & adoption'!$G$4=\"ALL\",'Product benefit & adoption'!AE15*'Product benefit & adoption'!$P15/1000000,'Product benefit & adoption'!$G$4=\"2020-25\",'Product benefit & adoption'!AE15*'Product benefit & adoption'!$N15/1000000,'Product benefit & adoption'!$G$4=\"2015-20\",'Product benefit & adoption'!AE15*'Product benefit & adoption'!$L15/1000000)","v":0},{"$f":"_xlfn.IFS('Product benefit & adoption'!$G$4=\"ALL\",'Product benefit & adoption'!AF15*'Product benefit & adoption'!$P15/1000000,'Product benefit & adoption'!$G$4=\"2020-25\",'Product benefit & adoption'!AF15*'Product benefit & adoption'!$N15/1000000,'Product benefit & adoption'!$G$4=\"2015-20\",'Product benefit & adoption'!AF15*'Product benefit & adoption'!$L15/1000000)","v":0},{"$f":"_xlfn.IFS('Product benefit & adoption'!$G$4=\"ALL\",'Product benefit & adoption'!AG15*'Product benefit & adoption'!$P15/1000000,'Product benefit & adoption'!$G$4=\"2020-25\",'Product benefit & adoption'!AG15*'Product benefit & adoption'!$N15/1000000,'Product benefit & adoption'!$G$4=\"2015-20\",'Product benefit & adoption'!AG15*'Product benefit & adoption'!$L15/1000000)","v":0},{"$f":"_xlfn.IFS('Product benefit & adoption'!$G$4=\"ALL\",'Product benefit & adoption'!AH15*'Product benefit & adoption'!$P15/1000000,'Product benefit & adoption'!$G$4=\"2020-25\",'Product benefit & adoption'!AH15*'Product benefit & adoption'!$N15/1000000,'Product benefit & adoption'!$G$4=\"2015-20\",'Product benefit & adoption'!AH15*'Product benefit & adoption'!$L15/1000000)","v":0},{"$f":"_xlfn.IFS('Product benefit & adoption'!$G$4=\"ALL\",'Product benefit & adoption'!AI15*'Product benefit & adoption'!$P15/1000000,'Product benefit & adoption'!$G$4=\"2020-25\",'Product benefit & adoption'!AI15*'Product benefit & adoption'!$N15/1000000,'Product benefit & adoption'!$G$4=\"2015-20\",'Product benefit & adoption'!AI15*'Product benefit & adoption'!$L15/1000000)","v":0},{"$f":"_xlfn.IFS('Product benefit & adoption'!$G$4=\"ALL\",'Product benefit & adoption'!AJ15*'Product benefit & adoption'!$P15/1000000,'Product benefit & adoption'!$G$4=\"2020-25\",'Product benefit & adoption'!AJ15*'Product benefit & adoption'!$N15/1000000,'Product benefit & adoption'!$G$4=\"2015-20\",'Product benefit & adoption'!AJ15*'Product benefit & adoption'!$L15/1000000)","v":0},{"$f":"_xlfn.IFS('Product benefit & adoption'!$G$4=\"ALL\",'Product benefit & adoption'!AK15*'Product benefit & adoption'!$P15/1000000,'Product benefit & adoption'!$G$4=\"2020-25\",'Product benefit & adoption'!AK15*'Product benefit & adoption'!$N15/1000000,'Product benefit & adoption'!$G$4=\"2015-20\",'Product benefit & adoption'!AK15*'Product benefit & adoption'!$L15/1000000)","v":0},{"$f":"_xlfn.IFS('Product benefit & adoption'!$G$4=\"ALL\",'Product benefit & adoption'!AL15*'Product benefit & adoption'!$P15/1000000,'Product benefit & adoption'!$G$4=\"2020-25\",'Product benefit & adoption'!AL15*'Product benefit & adoption'!$N15/1000000,'Product benefit & adoption'!$G$4=\"2015-20\",'Product benefit & adoption'!AL15*'Product benefit & adoption'!$L15/1000000)","v":0},{"$f":"_xlfn.IFS('Product benefit & adoption'!$G$4=\"ALL\",'Product benefit & adoption'!AM15*'Product benefit & adoption'!$P15/1000000,'Product benefit & adoption'!$G$4=\"2020-25\",'Product benefit & adoption'!AM15*'Product benefit & adoption'!$N15/1000000,'Product benefit & adoption'!$G$4=\"2015-20\",'Product benefit & adoption'!AM15*'Product benefit & adoption'!$L15/1000000)","v":0},{"$f":"_xlfn.IFS('Product benefit & adoption'!$G$4=\"ALL\",'Product benefit & adoption'!AN15*'Product benefit & adoption'!$P15/1000000,'Product benefit & adoption'!$G$4=\"2020-25\",'Product benefit & adoption'!AN15*'Product benefit & adoption'!$N15/1000000,'Product benefit & adoption'!$G$4=\"2015-20\",'Product benefit & adoption'!AN15*'Product benefit & adoption'!$L15/1000000)","v":0},{"$f":"_xlfn.IFS('Product benefit & adoption'!$G$4=\"ALL\",'Product benefit & adoption'!AO15*'Product benefit & adoption'!$P15/1000000,'Product benefit & adoption'!$G$4=\"2020-25\",'Product benefit & adoption'!AO15*'Product benefit & adoption'!$N15/1000000,'Product benefit & adoption'!$G$4=\"2015-20\",'Product benefit & adoption'!AO15*'Product benefit & adoption'!$L15/1000000)","v":0},{"$f":"_xlfn.IFS('Product benefit & adoption'!$G$4=\"ALL\",'Product benefit & adoption'!AP15*'Product benefit & adoption'!$P15/1000000,'Product benefit & adoption'!$G$4=\"2020-25\",'Product benefit & adoption'!AP15*'Product benefit & adoption'!$N15/1000000,'Product benefit & adoption'!$G$4=\"2015-20\",'Product benefit & adoption'!AP15*'Product benefit & adoption'!$L15/1000000)","v":0},{"$f":"_xlfn.IFS('Product benefit & adoption'!$G$4=\"ALL\",'Product benefit & adoption'!AQ15*'Product benefit & adoption'!$P15/1000000,'Product benefit & adoption'!$G$4=\"2020-25\",'Product benefit & adoption'!AQ15*'Product benefit & adoption'!$N15/1000000,'Product benefit & adoption'!$G$4=\"2015-20\",'Product benefit & adoption'!AQ15*'Product benefit & adoption'!$L15/1000000)","v":0},{"$f":"_xlfn.IFS('Product benefit & adoption'!$G$4=\"ALL\",'Product benefit & adoption'!AR15*'Product benefit & adoption'!$P15/1000000,'Product benefit & adoption'!$G$4=\"2020-25\",'Product benefit & adoption'!AR15*'Product benefit & adoption'!$N15/1000000,'Product benefit & adoption'!$G$4=\"2015-20\",'Product benefit & adoption'!AR15*'Product benefit & adoption'!$L15/1000000)","v":0},{"$f":"_xlfn.IFS('Product benefit & adoption'!$G$4=\"ALL\",'Product benefit & adoption'!AS15*'Product benefit & adoption'!$P15/1000000,'Product benefit & adoption'!$G$4=\"2020-25\",'Product benefit & adoption'!AS15*'Product benefit & adoption'!$N15/1000000,'Product benefit & adoption'!$G$4=\"2015-20\",'Product benefit & adoption'!AS15*'Product benefit & adoption'!$L15/1000000)","v":0},{"$f":"_xlfn.IFS('Product benefit & adoption'!$G$4=\"ALL\",'Product benefit & adoption'!AT15*'Product benefit & adoption'!$P15/1000000,'Product benefit & adoption'!$G$4=\"2020-25\",'Product benefit & adoption'!AT15*'Product benefit & adoption'!$N15/1000000,'Product benefit & adoption'!$G$4=\"2015-20\",'Product benefit & adoption'!AT15*'Product benefit & adoption'!$L15/1000000)","v":0},{"$f":"_xlfn.IFS('Product benefit & adoption'!$G$4=\"ALL\",'Product benefit & adoption'!AU15*'Product benefit & adoption'!$P15/1000000,'Product benefit & adoption'!$G$4=\"2020-25\",'Product benefit & adoption'!AU15*'Product benefit & adoption'!$N15/1000000,'Product benefit & adoption'!$G$4=\"2015-20\",'Product benefit & adoption'!AU15*'Product benefit & adoption'!$L15/1000000)","v":0},{"$f":"_xlfn.IFS('Product benefit & adoption'!$G$4=\"ALL\",'Product benefit & adoption'!AV15*'Product benefit & adoption'!$P15/1000000,'Product benefit & adoption'!$G$4=\"2020-25\",'Product benefit & adoption'!AV15*'Product benefit & adoption'!$N15/1000000,'Product benefit & adoption'!$G$4=\"2015-20\",'Product benefit & adoption'!AV15*'Product benefit & adoption'!$L15/1000000)","v":0},{"$f":"_xlfn.IFS('Product benefit & adoption'!$G$4=\"ALL\",'Product benefit & adoption'!AW15*'Product benefit & adoption'!$P15/1000000,'Product benefit & adoption'!$G$4=\"2020-25\",'Product benefit & adoption'!AW15*'Product benefit & adoption'!$N15/1000000,'Product benefit & adoption'!$G$4=\"2015-20\",'Product benefit & adoption'!AW15*'Product benefit & adoption'!$L15/1000000)","v":0},{"$f":"_xlfn.IFS('Product benefit & adoption'!$G$4=\"ALL\",'Product benefit & adoption'!AX15*'Product benefit & adoption'!$P15/1000000,'Product benefit & adoption'!$G$4=\"2020-25\",'Product benefit & adoption'!AX15*'Product benefit & adoption'!$N15/1000000,'Product benefit & adoption'!$G$4=\"2015-20\",'Product benefit & adoption'!AX15*'Product benefit & adoption'!$L15/1000000)","v":0},{"$f":"_xlfn.IFS('Product benefit & adoption'!$G$4=\"ALL\",'Product benefit & adoption'!AY15*'Product benefit & adoption'!$P15/1000000,'Product benefit & adoption'!$G$4=\"2020-25\",'Product benefit & adoption'!AY15*'Product benefit & adoption'!$N15/1000000,'Product benefit & adoption'!$G$4=\"2015-20\",'Product benefit & adoption'!AY15*'Product benefit & adoption'!$L15/1000000)","v":0},{"$f":"_xlfn.IFS('Product benefit & adoption'!$G$4=\"ALL\",'Product benefit & adoption'!AZ15*'Product benefit & adoption'!$P15/1000000,'Product benefit & adoption'!$G$4=\"2020-25\",'Product benefit & adoption'!AZ15*'Product benefit & adoption'!$N15/1000000,'Product benefit & adoption'!$G$4=\"2015-20\",'Product benefit & adoption'!AZ15*'Product benefit & adoption'!$L15/1000000)","v":0},{"$f":"_xlfn.IFS('Product benefit & adoption'!$G$4=\"ALL\",'Product benefit & adoption'!BA15*'Product benefit & adoption'!$P15/1000000,'Product benefit & adoption'!$G$4=\"2020-25\",'Product benefit & adoption'!BA15*'Product benefit & adoption'!$N15/1000000,'Product benefit & adoption'!$G$4=\"2015-20\",'Product benefit & adoption'!BA15*'Product benefit & adoption'!$L15/1000000)","v":0},{"$f":"_xlfn.IFS('Product benefit & adoption'!$G$4=\"ALL\",'Product benefit & adoption'!BB15*'Product benefit & adoption'!$P15/1000000,'Product benefit & adoption'!$G$4=\"2020-25\",'Product benefit & adoption'!BB15*'Product benefit & adoption'!$N15/1000000,'Product benefit & adoption'!$G$4=\"2015-20\",'Product benefit & adoption'!BB15*'Product benefit & adoption'!$L15/1000000)","v":0},{"$f":"_xlfn.IFS('Product benefit & adoption'!$G$4=\"ALL\",'Product benefit & adoption'!BC15*'Product benefit & adoption'!$P15/1000000,'Product benefit & adoption'!$G$4=\"2020-25\",'Product benefit & adoption'!BC15*'Product benefit & adoption'!$N15/1000000,'Product benefit & adoption'!$G$4=\"2015-20\",'Product benefit & adoption'!BC15*'Product benefit & adoption'!$L15/1000000)","v":0},{"$f":"_xlfn.IFS('Product benefit & adoption'!$G$4=\"ALL\",'Product benefit & adoption'!BD15*'Product benefit & adoption'!$P15/1000000,'Product benefit & adoption'!$G$4=\"2020-25\",'Product benefit & adoption'!BD15*'Product benefit & adoption'!$N15/1000000,'Product benefit & adoption'!$G$4=\"2015-20\",'Product benefit & adoption'!BD15*'Product benefit & adoption'!$L15/1000000)","v":0}]
[null,6,{"$f":"IF('Product benefit & adoption'!D16=\"\",\"\",'Product benefit & adoption'!D16)","v":""},{"$f":"IF('Product benefit & adoption'!F16=\"\",\"\",'Product benefit & adoption'!F16)","v":""},0,{"$f":"_xlfn.IFS('Product benefit & adoption'!$G$4=\"ALL\",'Product benefit & adoption'!AA16*'Product benefit & adoption'!$P16/1000000,'Product benefit & adoption'!$G$4=\"2020-25\",'Product benefit & adoption'!AA16*'Product benefit & adoption'!$N16/1000000,'Product benefit & adoption'!$G$4=\"2015-20\",'Product benefit & adoption'!AA16*'Product benefit & adoption'!$L16/1000000)","v":0},{"$f":"_xlfn.IFS('Product benefit & adoption'!$G$4=\"ALL\",'Product benefit & adoption'!AB16*'Product benefit & adoption'!$P16/1000000,'Product benefit & adoption'!$G$4=\"2020-25\",'Product benefit & adoption'!AB16*'Product benefit & adoption'!$N16/1000000,'Product benefit & adoption'!$G$4=\"2015-20\",'Product benefit & adoption'!AB16*'Product benefit & adoption'!$L16/1000000)","v":0},{"$f":"_xlfn.IFS('Product benefit & adoption'!$G$4=\"ALL\",'Product benefit & adoption'!AC16*'Product benefit & adoption'!$P16/1000000,'Product benefit & adoption'!$G$4=\"2020-25\",'Product benefit & adoption'!AC16*'Product benefit & adoption'!$N16/1000000,'Product benefit & adoption'!$G$4=\"2015-20\",'Product benefit & adoption'!AC16*'Product benefit & adoption'!$L16/1000000)","v":0},{"$f":"_xlfn.IFS('Product benefit & adoption'!$G$4=\"ALL\",'Product benefit & adoption'!AD16*'Product benefit & adoption'!$P16/1000000,'Product benefit & adoption'!$G$4=\"2020-25\",'Product benefit & adoption'!AD16*'Product benefit & adoption'!$N16/1000000,'Product benefit & adoption'!$G$4=\"2015-20\",'Product benefit & adoption'!AD16*'Product benefit & adoption'!$L16/1000000)","v":0},{"$f":"_xlfn.IFS('Product benefit & adoption'!$G$4=\"ALL\",'Product benefit & adoption'!AE16*'Product benefit & adoption'!$P16/1000000,'Product benefit & adoption'!$G$4=\"2020-25\",'Product benefit & adoption'!AE16*'Product benefit & adoption'!$N16/1000000,'Product benefit & adoption'!$G$4=\"2015-20\",'Product benefit & adoption'!AE16*'Product benefit & adoption'!$L16/1000000)","v":0},{"$f":"_xlfn.IFS('Product benefit & adoption'!$G$4=\"ALL\",'Product benefit & adoption'!AF16*'Product benefit & adoption'!$P16/1000000,'Product benefit & adoption'!$G$4=\"2020-25\",'Product benefit & adoption'!AF16*'Product benefit & adoption'!$N16/1000000,'Product benefit & adoption'!$G$4=\"2015-20\",'Product benefit & adoption'!AF16*'Product benefit & adoption'!$L16/1000000)","v":0},{"$f":"_xlfn.IFS('Product benefit & adoption'!$G$4=\"ALL\",'Product benefit & adoption'!AG16*'Product benefit & adoption'!$P16/1000000,'Product benefit & adoption'!$G$4=\"2020-25\",'Product benefit & adoption'!AG16*'Product benefit & adoption'!$N16/1000000,'Product benefit & adoption'!$G$4=\"2015-20\",'Product benefit & adoption'!AG16*'Product benefit & adoption'!$L16/1000000)","v":0},{"$f":"_xlfn.IFS('Product benefit & adoption'!$G$4=\"ALL\",'Product benefit & adoption'!AH16*'Product benefit & adoption'!$P16/1000000,'Product benefit & adoption'!$G$4=\"2020-25\",'Product benefit & adoption'!AH16*'Product benefit & adoption'!$N16/1000000,'Product benefit & adoption'!$G$4=\"2015-20\",'Product benefit & adoption'!AH16*'Product benefit & adoption'!$L16/1000000)","v":0},{"$f":"_xlfn.IFS('Product benefit & adoption'!$G$4=\"ALL\",'Product benefit & adoption'!AI16*'Product benefit & adoption'!$P16/1000000,'Product benefit & adoption'!$G$4=\"2020-25\",'Product benefit & adoption'!AI16*'Product benefit & adoption'!$N16/1000000,'Product benefit & adoption'!$G$4=\"2015-20\",'Product benefit & adoption'!AI16*'Product benefit & adoption'!$L16/1000000)","v":0},{"$f":"_xlfn.IFS('Product benefit & adoption'!$G$4=\"ALL\",'Product benefit & adoption'!AJ16*'Product benefit & adoption'!$P16/1000000,'Product benefit & adoption'!$G$4=\"2020-25\",'Product benefit & adoption'!AJ16*'Product benefit & adoption'!$N16/1000000,'Product benefit & adoption'!$G$4=\"2015-20\",'Product benefit & adoption'!AJ16*'Product benefit & adoption'!$L16/1000000)","v":0},{"$f":"_xlfn.IFS('Product benefit & adoption'!$G$4=\"ALL\",'Product benefit & adoption'!AK16*'Product benefit & adoption'!$P16/1000000,'Product benefit & adoption'!$G$4=\"2020-25\",'Product benefit & adoption'!AK16*'Product benefit & adoption'!$N16/1000000,'Product benefit & adoption'!$G$4=\"2015-20\",'Product benefit & adoption'!AK16*'Product benefit & adoption'!$L16/1000000)","v":0},{"$f":"_xlfn.IFS('Product benefit & adoption'!$G$4=\"ALL\",'Product benefit & adoption'!AL16*'Product benefit & adoption'!$P16/1000000,'Product benefit & adoption'!$G$4=\"2020-25\",'Product benefit & adoption'!AL16*'Product benefit & adoption'!$N16/1000000,'Product benefit & adoption'!$G$4=\"2015-20\",'Product benefit & adoption'!AL16*'Product benefit & adoption'!$L16/1000000)","v":0},{"$f":"_xlfn.IFS('Product benefit & adoption'!$G$4=\"ALL\",'Product benefit & adoption'!AM16*'Product benefit & adoption'!$P16/1000000,'Product benefit & adoption'!$G$4=\"2020-25\",'Product benefit & adoption'!AM16*'Product benefit & adoption'!$N16/1000000,'Product benefit & adoption'!$G$4=\"2015-20\",'Product benefit & adoption'!AM16*'Product benefit & adoption'!$L16/1000000)","v":0},{"$f":"_xlfn.IFS('Product benefit & adoption'!$G$4=\"ALL\",'Product benefit & adoption'!AN16*'Product benefit & adoption'!$P16/1000000,'Product benefit & adoption'!$G$4=\"2020-25\",'Product benefit & adoption'!AN16*'Product benefit & adoption'!$N16/1000000,'Product benefit & adoption'!$G$4=\"2015-20\",'Product benefit & adoption'!AN16*'Product benefit & adoption'!$L16/1000000)","v":0},{"$f":"_xlfn.IFS('Product benefit & adoption'!$G$4=\"ALL\",'Product benefit & adoption'!AO16*'Product benefit & adoption'!$P16/1000000,'Product benefit & adoption'!$G$4=\"2020-25\",'Product benefit & adoption'!AO16*'Product benefit & adoption'!$N16/1000000,'Product benefit & adoption'!$G$4=\"2015-20\",'Product benefit & adoption'!AO16*'Product benefit & adoption'!$L16/1000000)","v":0},{"$f":"_xlfn.IFS('Product benefit & adoption'!$G$4=\"ALL\",'Product benefit & adoption'!AP16*'Product benefit & adoption'!$P16/1000000,'Product benefit & adoption'!$G$4=\"2020-25\",'Product benefit & adoption'!AP16*'Product benefit & adoption'!$N16/1000000,'Product benefit & adoption'!$G$4=\"2015-20\",'Product benefit & adoption'!AP16*'Product benefit & adoption'!$L16/1000000)","v":0},{"$f":"_xlfn.IFS('Product benefit & adoption'!$G$4=\"ALL\",'Product benefit & adoption'!AQ16*'Product benefit & adoption'!$P16/1000000,'Product benefit & adoption'!$G$4=\"2020-25\",'Product benefit & adoption'!AQ16*'Product benefit & adoption'!$N16/1000000,'Product benefit & adoption'!$G$4=\"2015-20\",'Product benefit & adoption'!AQ16*'Product benefit & adoption'!$L16/1000000)","v":0},{"$f":"_xlfn.IFS('Product benefit & adoption'!$G$4=\"ALL\",'Product benefit & adoption'!AR16*'Product benefit & adoption'!$P16/1000000,'Product benefit & adoption'!$G$4=\"2020-25\",'Product benefit & adoption'!AR16*'Product benefit & adoption'!$N16/1000000,'Product benefit & adoption'!$G$4=\"2015-20\",'Product benefit & adoption'!AR16*'Product benefit & adoption'!$L16/1000000)","v":0},{"$f":"_xlfn.IFS('Product benefit & adoption'!$G$4=\"ALL\",'Product benefit & adoption'!AS16*'Product benefit & adoption'!$P16/1000000,'Product benefit & adoption'!$G$4=\"2020-25\",'Product benefit & adoption'!AS16*'Product benefit & adoption'!$N16/1000000,'Product benefit & adoption'!$G$4=\"2015-20\",'Product benefit & adoption'!AS16*'Product benefit & adoption'!$L16/1000000)","v":0},{"$f":"_xlfn.IFS('Product benefit & adoption'!$G$4=\"ALL\",'Product benefit & adoption'!AT16*'Product benefit & adoption'!$P16/1000000,'Product benefit & adoption'!$G$4=\"2020-25\",'Product benefit & adoption'!AT16*'Product benefit & adoption'!$N16/1000000,'Product benefit & adoption'!$G$4=\"2015-20\",'Product benefit & adoption'!AT16*'Product benefit & adoption'!$L16/1000000)","v":0},{"$f":"_xlfn.IFS('Product benefit & adoption'!$G$4=\"ALL\",'Product benefit & adoption'!AU16*'Product benefit & adoption'!$P16/1000000,'Product benefit & adoption'!$G$4=\"2020-25\",'Product benefit & adoption'!AU16*'Product benefit & adoption'!$N16/1000000,'Product benefit & adoption'!$G$4=\"2015-20\",'Product benefit & adoption'!AU16*'Product benefit & adoption'!$L16/1000000)","v":0},{"$f":"_xlfn.IFS('Product benefit & adoption'!$G$4=\"ALL\",'Product benefit & adoption'!AV16*'Product benefit & adoption'!$P16/1000000,'Product benefit & adoption'!$G$4=\"2020-25\",'Product benefit & adoption'!AV16*'Product benefit & adoption'!$N16/1000000,'Product benefit & adoption'!$G$4=\"2015-20\",'Product benefit & adoption'!AV16*'Product benefit & adoption'!$L16/1000000)","v":0},{"$f":"_xlfn.IFS('Product benefit & adoption'!$G$4=\"ALL\",'Product benefit & adoption'!AW16*'Product benefit & adoption'!$P16/1000000,'Product benefit & adoption'!$G$4=\"2020-25\",'Product benefit & adoption'!AW16*'Product benefit & adoption'!$N16/1000000,'Product benefit & adoption'!$G$4=\"2015-20\",'Product benefit & adoption'!AW16*'Product benefit & adoption'!$L16/1000000)","v":0},{"$f":"_xlfn.IFS('Product benefit & adoption'!$G$4=\"ALL\",'Product benefit & adoption'!AX16*'Product benefit & adoption'!$P16/1000000,'Product benefit & adoption'!$G$4=\"2020-25\",'Product benefit & adoption'!AX16*'Product benefit & adoption'!$N16/1000000,'Product benefit & adoption'!$G$4=\"2015-20\",'Product benefit & adoption'!AX16*'Product benefit & adoption'!$L16/1000000)","v":0},{"$f":"_xlfn.IFS('Product benefit & adoption'!$G$4=\"ALL\",'Product benefit & adoption'!AY16*'Product benefit & adoption'!$P16/1000000,'Product benefit & adoption'!$G$4=\"2020-25\",'Product benefit & adoption'!AY16*'Product benefit & adoption'!$N16/1000000,'Product benefit & adoption'!$G$4=\"2015-20\",'Product benefit & adoption'!AY16*'Product benefit & adoption'!$L16/1000000)","v":0},{"$f":"_xlfn.IFS('Product benefit & adoption'!$G$4=\"ALL\",'Product benefit & adoption'!AZ16*'Product benefit & adoption'!$P16/1000000,'Product benefit & adoption'!$G$4=\"2020-25\",'Product benefit & adoption'!AZ16*'Product benefit & adoption'!$N16/1000000,'Product benefit & adoption'!$G$4=\"2015-20\",'Product benefit & adoption'!AZ16*'Product benefit & adoption'!$L16/1000000)","v":0},{"$f":"_xlfn.IFS('Product benefit & adoption'!$G$4=\"ALL\",'Product benefit & adoption'!BA16*'Product benefit & adoption'!$P16/1000000,'Product benefit & adoption'!$G$4=\"2020-25\",'Product benefit & adoption'!BA16*'Product benefit & adoption'!$N16/1000000,'Product benefit & adoption'!$G$4=\"2015-20\",'Product benefit & adoption'!BA16*'Product benefit & adoption'!$L16/1000000)","v":0},{"$f":"_xlfn.IFS('Product benefit & adoption'!$G$4=\"ALL\",'Product benefit & adoption'!BB16*'Product benefit & adoption'!$P16/1000000,'Product benefit & adoption'!$G$4=\"2020-25\",'Product benefit & adoption'!BB16*'Product benefit & adoption'!$N16/1000000,'Product benefit & adoption'!$G$4=\"2015-20\",'Product benefit & adoption'!BB16*'Product benefit & adoption'!$L16/1000000)","v":0},{"$f":"_xlfn.IFS('Product benefit & adoption'!$G$4=\"ALL\",'Product benefit & adoption'!BC16*'Product benefit & adoption'!$P16/1000000,'Product benefit & adoption'!$G$4=\"2020-25\",'Product benefit & adoption'!BC16*'Product benefit & adoption'!$N16/1000000,'Product benefit & adoption'!$G$4=\"2015-20\",'Product benefit & adoption'!BC16*'Product benefit & adoption'!$L16/1000000)","v":0},{"$f":"_xlfn.IFS('Product benefit & adoption'!$G$4=\"ALL\",'Product benefit & adoption'!BD16*'Product benefit & adoption'!$P16/1000000,'Product benefit & adoption'!$G$4=\"2020-25\",'Product benefit & adoption'!BD16*'Product benefit & adoption'!$N16/1000000,'Product benefit & adoption'!$G$4=\"2015-20\",'Product benefit & adoption'!BD16*'Product benefit & adoption'!$L16/1000000)","v":0}]
[null,7,{"$f":"IF('Product benefit & adoption'!D17=\"\",\"\",'Product benefit & adoption'!D17)","v":""},{"$f":"IF('Product benefit & adoption'!F17=\"\",\"\",'Product benefit & adoption'!F17)","v":""},0,{"$f":"_xlfn.IFS('Product benefit & adoption'!$G$4=\"ALL\",'Product benefit & adoption'!AA17*'Product benefit & adoption'!$P17/1000000,'Product benefit & adoption'!$G$4=\"2020-25\",'Product benefit & adoption'!AA17*'Product benefit & adoption'!$N17/1000000,'Product benefit & adoption'!$G$4=\"2015-20\",'Product benefit & adoption'!AA17*'Product benefit & adoption'!$L17/1000000)","v":0},{"$f":"_xlfn.IFS('Product benefit & adoption'!$G$4=\"ALL\",'Product benefit & adoption'!AB17*'Product benefit & adoption'!$P17/1000000,'Product benefit & adoption'!$G$4=\"2020-25\",'Product benefit & adoption'!AB17*'Product benefit & adoption'!$N17/1000000,'Product benefit & adoption'!$G$4=\"2015-20\",'Product benefit & adoption'!AB17*'Product benefit & adoption'!$L17/1000000)","v":0},{"$f":"_xlfn.IFS('Product benefit & adoption'!$G$4=\"ALL\",'Product benefit & adoption'!AC17*'Product benefit & adoption'!$P17/1000000,'Product benefit & adoption'!$G$4=\"2020-25\",'Product benefit & adoption'!AC17*'Product benefit & adoption'!$N17/1000000,'Product benefit & adoption'!$G$4=\"2015-20\",'Product benefit & adoption'!AC17*'Product benefit & adoption'!$L17/1000000)","v":0},{"$f":"_xlfn.IFS('Product benefit & adoption'!$G$4=\"ALL\",'Product benefit & adoption'!AD17*'Product benefit & adoption'!$P17/1000000,'Product benefit & adoption'!$G$4=\"2020-25\",'Product benefit & adoption'!AD17*'Product benefit & adoption'!$N17/1000000,'Product benefit & adoption'!$G$4=\"2015-20\",'Product benefit & adoption'!AD17*'Product benefit & adoption'!$L17/1000000)","v":0},{"$f":"_xlfn.IFS('Product benefit & adoption'!$G$4=\"ALL\",'Product benefit & adoption'!AE17*'Product benefit & adoption'!$P17/1000000,'Product benefit & adoption'!$G$4=\"2020-25\",'Product benefit & adoption'!AE17*'Product benefit & adoption'!$N17/1000000,'Product benefit & adoption'!$G$4=\"2015-20\",'Product benefit & adoption'!AE17*'Product benefit & adoption'!$L17/1000000)","v":0},{"$f":"_xlfn.IFS('Product benefit & adoption'!$G$4=\"ALL\",'Product benefit & adoption'!AF17*'Product benefit & adoption'!$P17/1000000,'Product benefit & adoption'!$G$4=\"2020-25\",'Product benefit & adoption'!AF17*'Product benefit & adoption'!$N17/1000000,'Product benefit & adoption'!$G$4=\"2015-20\",'Product benefit & adoption'!AF17*'Product benefit & adoption'!$L17/1000000)","v":0},{"$f":"_xlfn.IFS('Product benefit & adoption'!$G$4=\"ALL\",'Product benefit & adoption'!AG17*'Product benefit & adoption'!$P17/1000000,'Product benefit & adoption'!$G$4=\"2020-25\",'Product benefit & adoption'!AG17*'Product benefit & adoption'!$N17/1000000,'Product benefit & adoption'!$G$4=\"2015-20\",'Product benefit & adoption'!AG17*'Product benefit & adoption'!$L17/1000000)","v":0},{"$f":"_xlfn.IFS('Product benefit & adoption'!$G$4=\"ALL\",'Product benefit & adoption'!AH17*'Product benefit & adoption'!$P17/1000000,'Product benefit & adoption'!$G$4=\"2020-25\",'Product benefit & adoption'!AH17*'Product benefit & adoption'!$N17/1000000,'Product benefit & adoption'!$G$4=\"2015-20\",'Product benefit & adoption'!AH17*'Product benefit & adoption'!$L17/1000000)","v":0},{"$f":"_xlfn.IFS('Product benefit & adoption'!$G$4=\"ALL\",'Product benefit & adoption'!AI17*'Product benefit & adoption'!$P17/1000000,'Product benefit & adoption'!$G$4=\"2020-25\",'Product benefit & adoption'!AI17*'Product benefit & adoption'!$N17/1000000,'Product benefit & adoption'!$G$4=\"2015-20\",'Product benefit & adoption'!AI17*'Product benefit & adoption'!$L17/1000000)","v":0},{"$f":"_xlfn.IFS('Product benefit & adoption'!$G$4=\"ALL\",'Product benefit & adoption'!AJ17*'Product benefit & adoption'!$P17/1000000,'Product benefit & adoption'!$G$4=\"2020-25\",'Product benefit & adoption'!AJ17*'Product benefit & adoption'!$N17/1000000,'Product benefit & adoption'!$G$4=\"2015-20\",'Product benefit & adoption'!AJ17*'Product benefit & adoption'!$L17/1000000)","v":0},{"$f":"_xlfn.IFS('Product benefit & adoption'!$G$4=\"ALL\",'Product benefit & adoption'!AK17*'Product benefit & adoption'!$P17/1000000,'Product benefit & adoption'!$G$4=\"2020-25\",'Product benefit & adoption'!AK17*'Product benefit & adoption'!$N17/1000000,'Product benefit & adoption'!$G$4=\"2015-20\",'Product benefit & adoption'!AK17*'Product benefit & adoption'!$L17/1000000)","v":0},{"$f":"_xlfn.IFS('Product benefit & adoption'!$G$4=\"ALL\",'Product benefit & adoption'!AL17*'Product benefit & adoption'!$P17/1000000,'Product benefit & adoption'!$G$4=\"2020-25\",'Product benefit & adoption'!AL17*'Product benefit & adoption'!$N17/1000000,'Product benefit & adoption'!$G$4=\"2015-20\",'Product benefit & adoption'!AL17*'Product benefit & adoption'!$L17/1000000)","v":0},{"$f":"_xlfn.IFS('Product benefit & adoption'!$G$4=\"ALL\",'Product benefit & adoption'!AM17*'Product benefit & adoption'!$P17/1000000,'Product benefit & adoption'!$G$4=\"2020-25\",'Product benefit & adoption'!AM17*'Product benefit & adoption'!$N17/1000000,'Product benefit & adoption'!$G$4=\"2015-20\",'Product benefit & adoption'!AM17*'Product benefit & adoption'!$L17/1000000)","v":0},{"$f":"_xlfn.IFS('Product benefit & adoption'!$G$4=\"ALL\",'Product benefit & adoption'!AN17*'Product benefit & adoption'!$P17/1000000,'Product benefit & adoption'!$G$4=\"2020-25\",'Product benefit & adoption'!AN17*'Product benefit & adoption'!$N17/1000000,'Product benefit & adoption'!$G$4=\"2015-20\",'Product benefit & adoption'!AN17*'Product benefit & adoption'!$L17/1000000)","v":0},{"$f":"_xlfn.IFS('Product benefit & adoption'!$G$4=\"ALL\",'Product benefit & adoption'!AO17*'Product benefit & adoption'!$P17/1000000,'Product benefit & adoption'!$G$4=\"2020-25\",'Product benefit & adoption'!AO17*'Product benefit & adoption'!$N17/1000000,'Product benefit & adoption'!$G$4=\"2015-20\",'Product benefit & adoption'!AO17*'Product benefit & adoption'!$L17/1000000)","v":0},{"$f":"_xlfn.IFS('Product benefit & adoption'!$G$4=\"ALL\",'Product benefit & adoption'!AP17*'Product benefit & adoption'!$P17/1000000,'Product benefit & adoption'!$G$4=\"2020-25\",'Product benefit & adoption'!AP17*'Product benefit & adoption'!$N17/1000000,'Product benefit & adoption'!$G$4=\"2015-20\",'Product benefit & adoption'!AP17*'Product benefit & adoption'!$L17/1000000)","v":0},{"$f":"_xlfn.IFS('Product benefit & adoption'!$G$4=\"ALL\",'Product benefit & adoption'!AQ17*'Product benefit & adoption'!$P17/1000000,'Product benefit & adoption'!$G$4=\"2020-25\",'Product benefit & adoption'!AQ17*'Product benefit & adoption'!$N17/1000000,'Product benefit & adoption'!$G$4=\"2015-20\",'Product benefit & adoption'!AQ17*'Product benefit & adoption'!$L17/1000000)","v":0},{"$f":"_xlfn.IFS('Product benefit & adoption'!$G$4=\"ALL\",'Product benefit & adoption'!AR17*'Product benefit & adoption'!$P17/1000000,'Product benefit & adoption'!$G$4=\"2020-25\",'Product benefit & adoption'!AR17*'Product benefit & adoption'!$N17/1000000,'Product benefit & adoption'!$G$4=\"2015-20\",'Product benefit & adoption'!AR17*'Product benefit & adoption'!$L17/1000000)","v":0},{"$f":"_xlfn.IFS('Product benefit & adoption'!$G$4=\"ALL\",'Product benefit & adoption'!AS17*'Product benefit & adoption'!$P17/1000000,'Product benefit & adoption'!$G$4=\"2020-25\",'Product benefit & adoption'!AS17*'Product benefit & adoption'!$N17/1000000,'Product benefit & adoption'!$G$4=\"2015-20\",'Product benefit & adoption'!AS17*'Product benefit & adoption'!$L17/1000000)","v":0},{"$f":"_xlfn.IFS('Product benefit & adoption'!$G$4=\"ALL\",'Product benefit & adoption'!AT17*'Product benefit & adoption'!$P17/1000000,'Product benefit & adoption'!$G$4=\"2020-25\",'Product benefit & adoption'!AT17*'Product benefit & adoption'!$N17/1000000,'Product benefit & adoption'!$G$4=\"2015-20\",'Product benefit & adoption'!AT17*'Product benefit & adoption'!$L17/1000000)","v":0},{"$f":"_xlfn.IFS('Product benefit & adoption'!$G$4=\"ALL\",'Product benefit & adoption'!AU17*'Product benefit & adoption'!$P17/1000000,'Product benefit & adoption'!$G$4=\"2020-25\",'Product benefit & adoption'!AU17*'Product benefit & adoption'!$N17/1000000,'Product benefit & adoption'!$G$4=\"2015-20\",'Product benefit & adoption'!AU17*'Product benefit & adoption'!$L17/1000000)","v":0},{"$f":"_xlfn.IFS('Product benefit & adoption'!$G$4=\"ALL\",'Product benefit & adoption'!AV17*'Product benefit & adoption'!$P17/1000000,'Product benefit & adoption'!$G$4=\"2020-25\",'Product benefit & adoption'!AV17*'Product benefit & adoption'!$N17/1000000,'Product benefit & adoption'!$G$4=\"2015-20\",'Product benefit & adoption'!AV17*'Product benefit & adoption'!$L17/1000000)","v":0},{"$f":"_xlfn.IFS('Product benefit & adoption'!$G$4=\"ALL\",'Product benefit & adoption'!AW17*'Product benefit & adoption'!$P17/1000000,'Product benefit & adoption'!$G$4=\"2020-25\",'Product benefit & adoption'!AW17*'Product benefit & adoption'!$N17/1000000,'Product benefit & adoption'!$G$4=\"2015-20\",'Product benefit & adoption'!AW17*'Product benefit & adoption'!$L17/1000000)","v":0},{"$f":"_xlfn.IFS('Product benefit & adoption'!$G$4=\"ALL\",'Product benefit & adoption'!AX17*'Product benefit & adoption'!$P17/1000000,'Product benefit & adoption'!$G$4=\"2020-25\",'Product benefit & adoption'!AX17*'Product benefit & adoption'!$N17/1000000,'Product benefit & adoption'!$G$4=\"2015-20\",'Product benefit & adoption'!AX17*'Product benefit & adoption'!$L17/1000000)","v":0},{"$f":"_xlfn.IFS('Product benefit & adoption'!$G$4=\"ALL\",'Product benefit & adoption'!AY17*'Product benefit & adoption'!$P17/1000000,'Product benefit & adoption'!$G$4=\"2020-25\",'Product benefit & adoption'!AY17*'Product benefit & adoption'!$N17/1000000,'Product benefit & adoption'!$G$4=\"2015-20\",'Product benefit & adoption'!AY17*'Product benefit & adoption'!$L17/1000000)","v":0},{"$f":"_xlfn.IFS('Product benefit & adoption'!$G$4=\"ALL\",'Product benefit & adoption'!AZ17*'Product benefit & adoption'!$P17/1000000,'Product benefit & adoption'!$G$4=\"2020-25\",'Product benefit & adoption'!AZ17*'Product benefit & adoption'!$N17/1000000,'Product benefit & adoption'!$G$4=\"2015-20\",'Product benefit & adoption'!AZ17*'Product benefit & adoption'!$L17/1000000)","v":0},{"$f":"_xlfn.IFS('Product benefit & adoption'!$G$4=\"ALL\",'Product benefit & adoption'!BA17*'Product benefit & adoption'!$P17/1000000,'Product benefit & adoption'!$G$4=\"2020-25\",'Product benefit & adoption'!BA17*'Product benefit & adoption'!$N17/1000000,'Product benefit & adoption'!$G$4=\"2015-20\",'Product benefit & adoption'!BA17*'Product benefit & adoption'!$L17/1000000)","v":0},{"$f":"_xlfn.IFS('Product benefit & adoption'!$G$4=\"ALL\",'Product benefit & adoption'!BB17*'Product benefit & adoption'!$P17/1000000,'Product benefit & adoption'!$G$4=\"2020-25\",'Product benefit & adoption'!BB17*'Product benefit & adoption'!$N17/1000000,'Product benefit & adoption'!$G$4=\"2015-20\",'Product benefit & adoption'!BB17*'Product benefit & adoption'!$L17/1000000)","v":0},{"$f":"_xlfn.IFS('Product benefit & adoption'!$G$4=\"ALL\",'Product benefit & adoption'!BC17*'Product benefit & adoption'!$P17/1000000,'Product benefit & adoption'!$G$4=\"2020-25\",'Product benefit & adoption'!BC17*'Product benefit & adoption'!$N17/1000000,'Product benefit & adoption'!$G$4=\"2015-20\",'Product benefit & adoption'!BC17*'Product benefit & adoption'!$L17/1000000)","v":0},{"$f":"_xlfn.IFS('Product benefit & adoption'!$G$4=\"ALL\",'Product benefit & adoption'!BD17*'Product benefit & adoption'!$P17/1000000,'Product benefit & adoption'!$G$4=\"2020-25\",'Product benefit & adoption'!BD17*'Product benefit & adoption'!$N17/1000000,'Product benefit & adoption'!$G$4=\"2015-20\",'Product benefit & adoption'!BD17*'Product benefit & adoption'!$L17/1000000)","v":0}]
[null,8,{"$f":"IF('Product benefit & adoption'!D18=\"\",\"\",'Product benefit & adoption'!D18)","v":""},{"$f":"IF('Product benefit & adoption'!F18=\"\",\"\",'Product benefit & adoption'!F18)","v":""},0,{"$f":"_xlfn.IFS('Product benefit & adoption'!$G$4=\"ALL\",'Product benefit & adoption'!AA18*'Product benefit & adoption'!$P18/1000000,'Product benefit & adoption'!$G$4=\"2020-25\",'Product benefit & adoption'!AA18*'Product benefit & adoption'!$N18/1000000,'Product benefit & adoption'!$G$4=\"2015-20\",'Product benefit & adoption'!AA18*'Product benefit & adoption'!$L18/1000000)","v":0},{"$f":"_xlfn.IFS('Product benefit & adoption'!$G$4=\"ALL\",'Product benefit & adoption'!AB18*'Product benefit & adoption'!$P18/1000000,'Product benefit & adoption'!$G$4=\"2020-25\",'Product benefit & adoption'!AB18*'Product benefit & adoption'!$N18/1000000,'Product benefit & adoption'!$G$4=\"2015-20\",'Product benefit & adoption'!AB18*'Product benefit & adoption'!$L18/1000000)","v":0},{"$f":"_xlfn.IFS('Product benefit & adoption'!$G$4=\"ALL\",'Product benefit & adoption'!AC18*'Product benefit & adoption'!$P18/1000000,'Product benefit & adoption'!$G$4=\"2020-25\",'Product benefit & adoption'!AC18*'Product benefit & adoption'!$N18/1000000,'Product benefit & adoption'!$G$4=\"2015-20\",'Product benefit & adoption'!AC18*'Product benefit & adoption'!$L18/1000000)","v":0},{"$f":"_xlfn.IFS('Product benefit & adoption'!$G$4=\"ALL\",'Product benefit & adoption'!AD18*'Product benefit & adoption'!$P18/1000000,'Product benefit & adoption'!$G$4=\"2020-25\",'Product benefit & adoption'!AD18*'Product benefit & adoption'!$N18/1000000,'Product benefit & adoption'!$G$4=\"2015-20\",'Product benefit & adoption'!AD18*'Product benefit & adoption'!$L18/1000000)","v":0},{"$f":"_xlfn.IFS('Product benefit & adoption'!$G$4=\"ALL\",'Product benefit & adoption'!AE18*'Product benefit & adoption'!$P18/1000000,'Product benefit & adoption'!$G$4=\"2020-25\",'Product benefit & adoption'!AE18*'Product benefit & adoption'!$N18/1000000,'Product benefit & adoption'!$G$4=\"2015-20\",'Product benefit & adoption'!AE18*'Product benefit & adoption'!$L18/1000000)","v":0},{"$f":"_xlfn.IFS('Product benefit & adoption'!$G$4=\"ALL\",'Product benefit & adoption'!AF18*'Product benefit & adoption'!$P18/1000000,'Product benefit & adoption'!$G$4=\"2020-25\",'Product benefit & adoption'!AF18*'Product benefit & adoption'!$N18/1000000,'Product benefit & adoption'!$G$4=\"2015-20\",'Product benefit & adoption'!AF18*'Product benefit & adoption'!$L18/1000000)","v":0},{"$f":"_xlfn.IFS('Product benefit & adoption'!$G$4=\"ALL\",'Product benefit & adoption'!AG18*'Product benefit & adoption'!$P18/1000000,'Product benefit & adoption'!$G$4=\"2020-25\",'Product benefit & adoption'!AG18*'Product benefit & adoption'!$N18/1000000,'Product benefit & adoption'!$G$4=\"2015-20\",'Product benefit & adoption'!AG18*'Product benefit & adoption'!$L18/1000000)","v":0},{"$f":"_xlfn.IFS('Product benefit & adoption'!$G$4=\"ALL\",'Product benefit & adoption'!AH18*'Product benefit & adoption'!$P18/1000000,'Product benefit & adoption'!$G$4=\"2020-25\",'Product benefit & adoption'!AH18*'Product benefit & adoption'!$N18/1000000,'Product benefit & adoption'!$G$4=\"2015-20\",'Product benefit & adoption'!AH18*'Product benefit & adoption'!$L18/1000000)","v":0},{"$f":"_xlfn.IFS('Product benefit & adoption'!$G$4=\"ALL\",'Product benefit & adoption'!AI18*'Product benefit & adoption'!$P18/1000000,'Product benefit & adoption'!$G$4=\"2020-25\",'Product benefit & adoption'!AI18*'Product benefit & adoption'!$N18/1000000,'Product benefit & adoption'!$G$4=\"2015-20\",'Product benefit & adoption'!AI18*'Product benefit & adoption'!$L18/1000000)","v":0},{"$f":"_xlfn.IFS('Product benefit & adoption'!$G$4=\"ALL\",'Product benefit & adoption'!AJ18*'Product benefit & adoption'!$P18/1000000,'Product benefit & adoption'!$G$4=\"2020-25\",'Product benefit & adoption'!AJ18*'Product benefit & adoption'!$N18/1000000,'Product benefit & adoption'!$G$4=\"2015-20\",'Product benefit & adoption'!AJ18*'Product benefit & adoption'!$L18/1000000)","v":0},{"$f":"_xlfn.IFS('Product benefit & adoption'!$G$4=\"ALL\",'Product benefit & adoption'!AK18*'Product benefit & adoption'!$P18/1000000,'Product benefit & adoption'!$G$4=\"2020-25\",'Product benefit & adoption'!AK18*'Product benefit & adoption'!$N18/1000000,'Product benefit & adoption'!$G$4=\"2015-20\",'Product benefit & adoption'!AK18*'Product benefit & adoption'!$L18/1000000)","v":0},{"$f":"_xlfn.IFS('Product benefit & adoption'!$G$4=\"ALL\",'Product benefit & adoption'!AL18*'Product benefit & adoption'!$P18/1000000,'Product benefit & adoption'!$G$4=\"2020-25\",'Product benefit & adoption'!AL18*'Product benefit & adoption'!$N18/1000000,'Product benefit & adoption'!$G$4=\"2015-20\",'Product benefit & adoption'!AL18*'Product benefit & adoption'!$L18/1000000)","v":0},{"$f":"_xlfn.IFS('Product benefit & adoption'!$G$4=\"ALL\",'Product benefit & adoption'!AM18*'Product benefit & adoption'!$P18/1000000,'Product benefit & adoption'!$G$4=\"2020-25\",'Product benefit & adoption'!AM18*'Product benefit & adoption'!$N18/1000000,'Product benefit & adoption'!$G$4=\"2015-20\",'Product benefit & adoption'!AM18*'Product benefit & adoption'!$L18/1000000)","v":0},{"$f":"_xlfn.IFS('Product benefit & adoption'!$G$4=\"ALL\",'Product benefit & adoption'!AN18*'Product benefit & adoption'!$P18/1000000,'Product benefit & adoption'!$G$4=\"2020-25\",'Product benefit & adoption'!AN18*'Product benefit & adoption'!$N18/1000000,'Product benefit & adoption'!$G$4=\"2015-20\",'Product benefit & adoption'!AN18*'Product benefit & adoption'!$L18/1000000)","v":0},{"$f":"_xlfn.IFS('Product benefit & adoption'!$G$4=\"ALL\",'Product benefit & adoption'!AO18*'Product benefit & adoption'!$P18/1000000,'Product benefit & adoption'!$G$4=\"2020-25\",'Product benefit & adoption'!AO18*'Product benefit & adoption'!$N18/1000000,'Product benefit & adoption'!$G$4=\"2015-20\",'Product benefit & adoption'!AO18*'Product benefit & adoption'!$L18/1000000)","v":0},{"$f":"_xlfn.IFS('Product benefit & adoption'!$G$4=\"ALL\",'Product benefit & adoption'!AP18*'Product benefit & adoption'!$P18/1000000,'Product benefit & adoption'!$G$4=\"2020-25\",'Product benefit & adoption'!AP18*'Product benefit & adoption'!$N18/1000000,'Product benefit & adoption'!$G$4=\"2015-20\",'Product benefit & adoption'!AP18*'Product benefit & adoption'!$L18/1000000)","v":0},{"$f":"_xlfn.IFS('Product benefit & adoption'!$G$4=\"ALL\",'Product benefit & adoption'!AQ18*'Product benefit & adoption'!$P18/1000000,'Product benefit & adoption'!$G$4=\"2020-25\",'Product benefit & adoption'!AQ18*'Product benefit & adoption'!$N18/1000000,'Product benefit & adoption'!$G$4=\"2015-20\",'Product benefit & adoption'!AQ18*'Product benefit & adoption'!$L18/1000000)","v":0},{"$f":"_xlfn.IFS('Product benefit & adoption'!$G$4=\"ALL\",'Product benefit & adoption'!AR18*'Product benefit & adoption'!$P18/1000000,'Product benefit & adoption'!$G$4=\"2020-25\",'Product benefit & adoption'!AR18*'Product benefit & adoption'!$N18/1000000,'Product benefit & adoption'!$G$4=\"2015-20\",'Product benefit & adoption'!AR18*'Product benefit & adoption'!$L18/1000000)","v":0},{"$f":"_xlfn.IFS('Product benefit & adoption'!$G$4=\"ALL\",'Product benefit & adoption'!AS18*'Product benefit & adoption'!$P18/1000000,'Product benefit & adoption'!$G$4=\"2020-25\",'Product benefit & adoption'!AS18*'Product benefit & adoption'!$N18/1000000,'Product benefit & adoption'!$G$4=\"2015-20\",'Product benefit & adoption'!AS18*'Product benefit & adoption'!$L18/1000000)","v":0},{"$f":"_xlfn.IFS('Product benefit & adoption'!$G$4=\"ALL\",'Product benefit & adoption'!AT18*'Product benefit & adoption'!$P18/1000000,'Product benefit & adoption'!$G$4=\"2020-25\",'Product benefit & adoption'!AT18*'Product benefit & adoption'!$N18/1000000,'Product benefit & adoption'!$G$4=\"2015-20\",'Product benefit & adoption'!AT18*'Product benefit & adoption'!$L18/1000000)","v":0},{"$f":"_xlfn.IFS('Product benefit & adoption'!$G$4=\"ALL\",'Product benefit & adoption'!AU18*'Product benefit & adoption'!$P18/1000000,'Product benefit & adoption'!$G$4=\"2020-25\",'Product benefit & adoption'!AU18*'Product benefit & adoption'!$N18/1000000,'Product benefit & adoption'!$G$4=\"2015-20\",'Product benefit & adoption'!AU18*'Product benefit & adoption'!$L18/1000000)","v":0},{"$f":"_xlfn.IFS('Product benefit & adoption'!$G$4=\"ALL\",'Product benefit & adoption'!AV18*'Product benefit & adoption'!$P18/1000000,'Product benefit & adoption'!$G$4=\"2020-25\",'Product benefit & adoption'!AV18*'Product benefit & adoption'!$N18/1000000,'Product benefit & adoption'!$G$4=\"2015-20\",'Product benefit & adoption'!AV18*'Product benefit & adoption'!$L18/1000000)","v":0},{"$f":"_xlfn.IFS('Product benefit & adoption'!$G$4=\"ALL\",'Product benefit & adoption'!AW18*'Product benefit & adoption'!$P18/1000000,'Product benefit & adoption'!$G$4=\"2020-25\",'Product benefit & adoption'!AW18*'Product benefit & adoption'!$N18/1000000,'Product benefit & adoption'!$G$4=\"2015-20\",'Product benefit & adoption'!AW18*'Product benefit & adoption'!$L18/1000000)","v":0},{"$f":"_xlfn.IFS('Product benefit & adoption'!$G$4=\"ALL\",'Product benefit & adoption'!AX18*'Product benefit & adoption'!$P18/1000000,'Product benefit & adoption'!$G$4=\"2020-25\",'Product benefit & adoption'!AX18*'Product benefit & adoption'!$N18/1000000,'Product benefit & adoption'!$G$4=\"2015-20\",'Product benefit & adoption'!AX18*'Product benefit & adoption'!$L18/1000000)","v":0},{"$f":"_xlfn.IFS('Product benefit & adoption'!$G$4=\"ALL\",'Product benefit & adoption'!AY18*'Product benefit & adoption'!$P18/1000000,'Product benefit & adoption'!$G$4=\"2020-25\",'Product benefit & adoption'!AY18*'Product benefit & adoption'!$N18/1000000,'Product benefit & adoption'!$G$4=\"2015-20\",'Product benefit & adoption'!AY18*'Product benefit & adoption'!$L18/1000000)","v":0},{"$f":"_xlfn.IFS('Product benefit & adoption'!$G$4=\"ALL\",'Product benefit & adoption'!AZ18*'Product benefit & adoption'!$P18/1000000,'Product benefit & adoption'!$G$4=\"2020-25\",'Product benefit & adoption'!AZ18*'Product benefit & adoption'!$N18/1000000,'Product benefit & adoption'!$G$4=\"2015-20\",'Product benefit & adoption'!AZ18*'Product benefit & adoption'!$L18/1000000)","v":0},{"$f":"_xlfn.IFS('Product benefit & adoption'!$G$4=\"ALL\",'Product benefit & adoption'!BA18*'Product benefit & adoption'!$P18/1000000,'Product benefit & adoption'!$G$4=\"2020-25\",'Product benefit & adoption'!BA18*'Product benefit & adoption'!$N18/1000000,'Product benefit & adoption'!$G$4=\"2015-20\",'Product benefit & adoption'!BA18*'Product benefit & adoption'!$L18/1000000)","v":0},{"$f":"_xlfn.IFS('Product benefit & adoption'!$G$4=\"ALL\",'Product benefit & adoption'!BB18*'Product benefit & adoption'!$P18/1000000,'Product benefit & adoption'!$G$4=\"2020-25\",'Product benefit & adoption'!BB18*'Product benefit & adoption'!$N18/1000000,'Product benefit & adoption'!$G$4=\"2015-20\",'Product benefit & adoption'!BB18*'Product benefit & adoption'!$L18/1000000)","v":0},{"$f":"_xlfn.IFS('Product benefit & adoption'!$G$4=\"ALL\",'Product benefit & adoption'!BC18*'Product benefit & adoption'!$P18/1000000,'Product benefit & adoption'!$G$4=\"2020-25\",'Product benefit & adoption'!BC18*'Product benefit & adoption'!$N18/1000000,'Product benefit & adoption'!$G$4=\"2015-20\",'Product benefit & adoption'!BC18*'Product benefit & adoption'!$L18/1000000)","v":0},{"$f":"_xlfn.IFS('Product benefit & adoption'!$G$4=\"ALL\",'Product benefit & adoption'!BD18*'Product benefit & adoption'!$P18/1000000,'Product benefit & adoption'!$G$4=\"2020-25\",'Product benefit & adoption'!BD18*'Product benefit & adoption'!$N18/1000000,'Product benefit & adoption'!$G$4=\"2015-20\",'Product benefit & adoption'!BD18*'Product benefit & adoption'!$L18/1000000)","v":0}]
[null,9,{"$f":"IF('Product benefit & adoption'!D19=\"\",\"\",'Product benefit & adoption'!D19)","v":""},{"$f":"IF('Product benefit & adoption'!F19=\"\",\"\",'Product benefit & adoption'!F19)","v":""},0,{"$f":"_xlfn.IFS('Product benefit & adoption'!$G$4=\"ALL\",'Product benefit & adoption'!AA19*'Product benefit & adoption'!$P19/1000000,'Product benefit & adoption'!$G$4=\"2020-25\",'Product benefit & adoption'!AA19*'Product benefit & adoption'!$N19/1000000,'Product benefit & adoption'!$G$4=\"2015-20\",'Product benefit & adoption'!AA19*'Product benefit & adoption'!$L19/1000000)","v":0},{"$f":"_xlfn.IFS('Product benefit & adoption'!$G$4=\"ALL\",'Product benefit & adoption'!AB19*'Product benefit & adoption'!$P19/1000000,'Product benefit & adoption'!$G$4=\"2020-25\",'Product benefit & adoption'!AB19*'Product benefit & adoption'!$N19/1000000,'Product benefit & adoption'!$G$4=\"2015-20\",'Product benefit & adoption'!AB19*'Product benefit & adoption'!$L19/1000000)","v":0},{"$f":"_xlfn.IFS('Product benefit & adoption'!$G$4=\"ALL\",'Product benefit & adoption'!AC19*'Product benefit & adoption'!$P19/1000000,'Product benefit & adoption'!$G$4=\"2020-25\",'Product benefit & adoption'!AC19*'Product benefit & adoption'!$N19/1000000,'Product benefit & adoption'!$G$4=\"2015-20\",'Product benefit & adoption'!AC19*'Product benefit & adoption'!$L19/1000000)","v":0},{"$f":"_xlfn.IFS('Product benefit & adoption'!$G$4=\"ALL\",'Product benefit & adoption'!AD19*'Product benefit & adoption'!$P19/1000000,'Product benefit & adoption'!$G$4=\"2020-25\",'Product benefit & adoption'!AD19*'Product benefit & adoption'!$N19/1000000,'Product benefit & adoption'!$G$4=\"2015-20\",'Product benefit & adoption'!AD19*'Product benefit & adoption'!$L19/1000000)","v":0},{"$f":"_xlfn.IFS('Product benefit & adoption'!$G$4=\"ALL\",'Product benefit & adoption'!AE19*'Product benefit & adoption'!$P19/1000000,'Product benefit & adoption'!$G$4=\"2020-25\",'Product benefit & adoption'!AE19*'Product benefit & adoption'!$N19/1000000,'Product benefit & adoption'!$G$4=\"2015-20\",'Product benefit & adoption'!AE19*'Product benefit & adoption'!$L19/1000000)","v":0},{"$f":"_xlfn.IFS('Product benefit & adoption'!$G$4=\"ALL\",'Product benefit & adoption'!AF19*'Product benefit & adoption'!$P19/1000000,'Product benefit & adoption'!$G$4=\"2020-25\",'Product benefit & adoption'!AF19*'Product benefit & adoption'!$N19/1000000,'Product benefit & adoption'!$G$4=\"2015-20\",'Product benefit & adoption'!AF19*'Product benefit & adoption'!$L19/1000000)","v":0},{"$f":"_xlfn.IFS('Product benefit & adoption'!$G$4=\"ALL\",'Product benefit & adoption'!AG19*'Product benefit & adoption'!$P19/1000000,'Product benefit & adoption'!$G$4=\"2020-25\",'Product benefit & adoption'!AG19*'Product benefit & adoption'!$N19/1000000,'Product benefit & adoption'!$G$4=\"2015-20\",'Product benefit & adoption'!AG19*'Product benefit & adoption'!$L19/1000000)","v":0},{"$f":"_xlfn.IFS('Product benefit & adoption'!$G$4=\"ALL\",'Product benefit & adoption'!AH19*'Product benefit & adoption'!$P19/1000000,'Product benefit & adoption'!$G$4=\"2020-25\",'Product benefit & adoption'!AH19*'Product benefit & adoption'!$N19/1000000,'Product benefit & adoption'!$G$4=\"2015-20\",'Product benefit & adoption'!AH19*'Product benefit & adoption'!$L19/1000000)","v":0},{"$f":"_xlfn.IFS('Product benefit & adoption'!$G$4=\"ALL\",'Product benefit & adoption'!AI19*'Product benefit & adoption'!$P19/1000000,'Product benefit & adoption'!$G$4=\"2020-25\",'Product benefit & adoption'!AI19*'Product benefit & adoption'!$N19/1000000,'Product benefit & adoption'!$G$4=\"2015-20\",'Product benefit & adoption'!AI19*'Product benefit & adoption'!$L19/1000000)","v":0},{"$f":"_xlfn.IFS('Product benefit & adoption'!$G$4=\"ALL\",'Product benefit & adoption'!AJ19*'Product benefit & adoption'!$P19/1000000,'Product benefit & adoption'!$G$4=\"2020-25\",'Product benefit & adoption'!AJ19*'Product benefit & adoption'!$N19/1000000,'Product benefit & adoption'!$G$4=\"2015-20\",'Product benefit & adoption'!AJ19*'Product benefit & adoption'!$L19/1000000)","v":0},{"$f":"_xlfn.IFS('Product benefit & adoption'!$G$4=\"ALL\",'Product benefit & adoption'!AK19*'Product benefit & adoption'!$P19/1000000,'Product benefit & adoption'!$G$4=\"2020-25\",'Product benefit & adoption'!AK19*'Product benefit & adoption'!$N19/1000000,'Product benefit & adoption'!$G$4=\"2015-20\",'Product benefit & adoption'!AK19*'Product benefit & adoption'!$L19/1000000)","v":0},{"$f":"_xlfn.IFS('Product benefit & adoption'!$G$4=\"ALL\",'Product benefit & adoption'!AL19*'Product benefit & adoption'!$P19/1000000,'Product benefit & adoption'!$G$4=\"2020-25\",'Product benefit & adoption'!AL19*'Product benefit & adoption'!$N19/1000000,'Product benefit & adoption'!$G$4=\"2015-20\",'Product benefit & adoption'!AL19*'Product benefit & adoption'!$L19/1000000)","v":0},{"$f":"_xlfn.IFS('Product benefit & adoption'!$G$4=\"ALL\",'Product benefit & adoption'!AM19*'Product benefit & adoption'!$P19/1000000,'Product benefit & adoption'!$G$4=\"2020-25\",'Product benefit & adoption'!AM19*'Product benefit & adoption'!$N19/1000000,'Product benefit & adoption'!$G$4=\"2015-20\",'Product benefit & adoption'!AM19*'Product benefit & adoption'!$L19/1000000)","v":0},{"$f":"_xlfn.IFS('Product benefit & adoption'!$G$4=\"ALL\",'Product benefit & adoption'!AN19*'Product benefit & adoption'!$P19/1000000,'Product benefit & adoption'!$G$4=\"2020-25\",'Product benefit & adoption'!AN19*'Product benefit & adoption'!$N19/1000000,'Product benefit & adoption'!$G$4=\"2015-20\",'Product benefit & adoption'!AN19*'Product benefit & adoption'!$L19/1000000)","v":0},{"$f":"_xlfn.IFS('Product benefit & adoption'!$G$4=\"ALL\",'Product benefit & adoption'!AO19*'Product benefit & adoption'!$P19/1000000,'Product benefit & adoption'!$G$4=\"2020-25\",'Product benefit & adoption'!AO19*'Product benefit & adoption'!$N19/1000000,'Product benefit & adoption'!$G$4=\"2015-20\",'Product benefit & adoption'!AO19*'Product benefit & adoption'!$L19/1000000)","v":0},{"$f":"_xlfn.IFS('Product benefit & adoption'!$G$4=\"ALL\",'Product benefit & adoption'!AP19*'Product benefit & adoption'!$P19/1000000,'Product benefit & adoption'!$G$4=\"2020-25\",'Product benefit & adoption'!AP19*'Product benefit & adoption'!$N19/1000000,'Product benefit & adoption'!$G$4=\"2015-20\",'Product benefit & adoption'!AP19*'Product benefit & adoption'!$L19/1000000)","v":0},{"$f":"_xlfn.IFS('Product benefit & adoption'!$G$4=\"ALL\",'Product benefit & adoption'!AQ19*'Product benefit & adoption'!$P19/1000000,'Product benefit & adoption'!$G$4=\"2020-25\",'Product benefit & adoption'!AQ19*'Product benefit & adoption'!$N19/1000000,'Product benefit & adoption'!$G$4=\"2015-20\",'Product benefit & adoption'!AQ19*'Product benefit & adoption'!$L19/1000000)","v":0},{"$f":"_xlfn.IFS('Product benefit & adoption'!$G$4=\"ALL\",'Product benefit & adoption'!AR19*'Product benefit & adoption'!$P19/1000000,'Product benefit & adoption'!$G$4=\"2020-25\",'Product benefit & adoption'!AR19*'Product benefit & adoption'!$N19/1000000,'Product benefit & adoption'!$G$4=\"2015-20\",'Product benefit & adoption'!AR19*'Product benefit & adoption'!$L19/1000000)","v":0},{"$f":"_xlfn.IFS('Product benefit & adoption'!$G$4=\"ALL\",'Product benefit & adoption'!AS19*'Product benefit & adoption'!$P19/1000000,'Product benefit & adoption'!$G$4=\"2020-25\",'Product benefit & adoption'!AS19*'Product benefit & adoption'!$N19/1000000,'Product benefit & adoption'!$G$4=\"2015-20\",'Product benefit & adoption'!AS19*'Product benefit & adoption'!$L19/1000000)","v":0},{"$f":"_xlfn.IFS('Product benefit & adoption'!$G$4=\"ALL\",'Product benefit & adoption'!AT19*'Product benefit & adoption'!$P19/1000000,'Product benefit & adoption'!$G$4=\"2020-25\",'Product benefit & adoption'!AT19*'Product benefit & adoption'!$N19/1000000,'Product benefit & adoption'!$G$4=\"2015-20\",'Product benefit & adoption'!AT19*'Product benefit & adoption'!$L19/1000000)","v":0},{"$f":"_xlfn.IFS('Product benefit & adoption'!$G$4=\"ALL\",'Product benefit & adoption'!AU19*'Product benefit & adoption'!$P19/1000000,'Product benefit & adoption'!$G$4=\"2020-25\",'Product benefit & adoption'!AU19*'Product benefit & adoption'!$N19/1000000,'Product benefit & adoption'!$G$4=\"2015-20\",'Product benefit & adoption'!AU19*'Product benefit & adoption'!$L19/1000000)","v":0},{"$f":"_xlfn.IFS('Product benefit & adoption'!$G$4=\"ALL\",'Product benefit & adoption'!AV19*'Product benefit & adoption'!$P19/1000000,'Product benefit & adoption'!$G$4=\"2020-25\",'Product benefit & adoption'!AV19*'Product benefit & adoption'!$N19/1000000,'Product benefit & adoption'!$G$4=\"2015-20\",'Product benefit & adoption'!AV19*'Product benefit & adoption'!$L19/1000000)","v":0},{"$f":"_xlfn.IFS('Product benefit & adoption'!$G$4=\"ALL\",'Product benefit & adoption'!AW19*'Product benefit & adoption'!$P19/1000000,'Product benefit & adoption'!$G$4=\"2020-25\",'Product benefit & adoption'!AW19*'Product benefit & adoption'!$N19/1000000,'Product benefit & adoption'!$G$4=\"2015-20\",'Product benefit & adoption'!AW19*'Product benefit & adoption'!$L19/1000000)","v":0},{"$f":"_xlfn.IFS('Product benefit & adoption'!$G$4=\"ALL\",'Product benefit & adoption'!AX19*'Product benefit & adoption'!$P19/1000000,'Product benefit & adoption'!$G$4=\"2020-25\",'Product benefit & adoption'!AX19*'Product benefit & adoption'!$N19/1000000,'Product benefit & adoption'!$G$4=\"2015-20\",'Product benefit & adoption'!AX19*'Product benefit & adoption'!$L19/1000000)","v":0},{"$f":"_xlfn.IFS('Product benefit & adoption'!$G$4=\"ALL\",'Product benefit & adoption'!AY19*'Product benefit & adoption'!$P19/1000000,'Product benefit & adoption'!$G$4=\"2020-25\",'Product benefit & adoption'!AY19*'Product benefit & adoption'!$N19/1000000,'Product benefit & adoption'!$G$4=\"2015-20\",'Product benefit & adoption'!AY19*'Product benefit & adoption'!$L19/1000000)","v":0},{"$f":"_xlfn.IFS('Product benefit & adoption'!$G$4=\"ALL\",'Product benefit & adoption'!AZ19*'Product benefit & adoption'!$P19/1000000,'Product benefit & adoption'!$G$4=\"2020-25\",'Product benefit & adoption'!AZ19*'Product benefit & adoption'!$N19/1000000,'Product benefit & adoption'!$G$4=\"2015-20\",'Product benefit & adoption'!AZ19*'Product benefit & adoption'!$L19/1000000)","v":0},{"$f":"_xlfn.IFS('Product benefit & adoption'!$G$4=\"ALL\",'Product benefit & adoption'!BA19*'Product benefit & adoption'!$P19/1000000,'Product benefit & adoption'!$G$4=\"2020-25\",'Product benefit & adoption'!BA19*'Product benefit & adoption'!$N19/1000000,'Product benefit & adoption'!$G$4=\"2015-20\",'Product benefit & adoption'!BA19*'Product benefit & adoption'!$L19/1000000)","v":0},{"$f":"_xlfn.IFS('Product benefit & adoption'!$G$4=\"ALL\",'Product benefit & adoption'!BB19*'Product benefit & adoption'!$P19/1000000,'Product benefit & adoption'!$G$4=\"2020-25\",'Product benefit & adoption'!BB19*'Product benefit & adoption'!$N19/1000000,'Product benefit & adoption'!$G$4=\"2015-20\",'Product benefit & adoption'!BB19*'Product benefit & adoption'!$L19/1000000)","v":0},{"$f":"_xlfn.IFS('Product benefit & adoption'!$G$4=\"ALL\",'Product benefit & adoption'!BC19*'Product benefit & adoption'!$P19/1000000,'Product benefit & adoption'!$G$4=\"2020-25\",'Product benefit & adoption'!BC19*'Product benefit & adoption'!$N19/1000000,'Product benefit & adoption'!$G$4=\"2015-20\",'Product benefit & adoption'!BC19*'Product benefit & adoption'!$L19/1000000)","v":0},{"$f":"_xlfn.IFS('Product benefit & adoption'!$G$4=\"ALL\",'Product benefit & adoption'!BD19*'Product benefit & adoption'!$P19/1000000,'Product benefit & adoption'!$G$4=\"2020-25\",'Product benefit & adoption'!BD19*'Product benefit & adoption'!$N19/1000000,'Product benefit & adoption'!$G$4=\"2015-20\",'Product benefit & adoption'!BD19*'Product benefit & adoption'!$L19/1000000)","v":0}]
[null,10,{"$f":"IF('Product benefit & adoption'!D20=\"\",\"\",'Product benefit & adoption'!D20)","v":""},{"$f":"IF('Product benefit & adoption'!F20=\"\",\"\",'Product benefit & adoption'!F20)","v":""},0,{"$f":"_xlfn.IFS('Product benefit & adoption'!$G$4=\"ALL\",'Product benefit & adoption'!AA20*'Product benefit & adoption'!$P20/1000000,'Product benefit & adoption'!$G$4=\"2020-25\",'Product benefit & adoption'!AA20*'Product benefit & adoption'!$N20/1000000,'Product benefit & adoption'!$G$4=\"2015-20\",'Product benefit & adoption'!AA20*'Product benefit & adoption'!$L20/1000000)","v":0},{"$f":"_xlfn.IFS('Product benefit & adoption'!$G$4=\"ALL\",'Product benefit & adoption'!AB20*'Product benefit & adoption'!$P20/1000000,'Product benefit & adoption'!$G$4=\"2020-25\",'Product benefit & adoption'!AB20*'Product benefit & adoption'!$N20/1000000,'Product benefit & adoption'!$G$4=\"2015-20\",'Product benefit & adoption'!AB20*'Product benefit & adoption'!$L20/1000000)","v":0},{"$f":"_xlfn.IFS('Product benefit & adoption'!$G$4=\"ALL\",'Product benefit & adoption'!AC20*'Product benefit & adoption'!$P20/1000000,'Product benefit & adoption'!$G$4=\"2020-25\",'Product benefit & adoption'!AC20*'Product benefit & adoption'!$N20/1000000,'Product benefit & adoption'!$G$4=\"2015-20\",'Product benefit & adoption'!AC20*'Product benefit & adoption'!$L20/1000000)","v":0},{"$f":"_xlfn.IFS('Product benefit & adoption'!$G$4=\"ALL\",'Product benefit & adoption'!AD20*'Product benefit & adoption'!$P20/1000000,'Product benefit & adoption'!$G$4=\"2020-25\",'Product benefit & adoption'!AD20*'Product benefit & adoption'!$N20/1000000,'Product benefit & adoption'!$G$4=\"2015-20\",'Product benefit & adoption'!AD20*'Product benefit & adoption'!$L20/1000000)","v":0},{"$f":"_xlfn.IFS('Product benefit & adoption'!$G$4=\"ALL\",'Product benefit & adoption'!AE20*'Product benefit & adoption'!$P20/1000000,'Product benefit & adoption'!$G$4=\"2020-25\",'Product benefit & adoption'!AE20*'Product benefit & adoption'!$N20/1000000,'Product benefit & adoption'!$G$4=\"2015-20\",'Product benefit & adoption'!AE20*'Product benefit & adoption'!$L20/1000000)","v":0},{"$f":"_xlfn.IFS('Product benefit & adoption'!$G$4=\"ALL\",'Product benefit & adoption'!AF20*'Product benefit & adoption'!$P20/1000000,'Product benefit & adoption'!$G$4=\"2020-25\",'Product benefit & adoption'!AF20*'Product benefit & adoption'!$N20/1000000,'Product benefit & adoption'!$G$4=\"2015-20\",'Product benefit & adoption'!AF20*'Product benefit & adoption'!$L20/1000000)","v":0},{"$f":"_xlfn.IFS('Product benefit & adoption'!$G$4=\"ALL\",'Product benefit & adoption'!AG20*'Product benefit & adoption'!$P20/1000000,'Product benefit & adoption'!$G$4=\"2020-25\",'Product benefit & adoption'!AG20*'Product benefit & adoption'!$N20/1000000,'Product benefit & adoption'!$G$4=\"2015-20\",'Product benefit & adoption'!AG20*'Product benefit & adoption'!$L20/1000000)","v":0},{"$f":"_xlfn.IFS('Product benefit & adoption'!$G$4=\"ALL\",'Product benefit & adoption'!AH20*'Product benefit & adoption'!$P20/1000000,'Product benefit & adoption'!$G$4=\"2020-25\",'Product benefit & adoption'!AH20*'Product benefit & adoption'!$N20/1000000,'Product benefit & adoption'!$G$4=\"2015-20\",'Product benefit & adoption'!AH20*'Product benefit & adoption'!$L20/1000000)","v":0},{"$f":"_xlfn.IFS('Product benefit & adoption'!$G$4=\"ALL\",'Product benefit & adoption'!AI20*'Product benefit & adoption'!$P20/1000000,'Product benefit & adoption'!$G$4=\"2020-25\",'Product benefit & adoption'!AI20*'Product benefit & adoption'!$N20/1000000,'Product benefit & adoption'!$G$4=\"2015-20\",'Product benefit & adoption'!AI20*'Product benefit & adoption'!$L20/1000000)","v":0},{"$f":"_xlfn.IFS('Product benefit & adoption'!$G$4=\"ALL\",'Product benefit & adoption'!AJ20*'Product benefit & adoption'!$P20/1000000,'Product benefit & adoption'!$G$4=\"2020-25\",'Product benefit & adoption'!AJ20*'Product benefit & adoption'!$N20/1000000,'Product benefit & adoption'!$G$4=\"2015-20\",'Product benefit & adoption'!AJ20*'Product benefit & adoption'!$L20/1000000)","v":0},{"$f":"_xlfn.IFS('Product benefit & adoption'!$G$4=\"ALL\",'Product benefit & adoption'!AK20*'Product benefit & adoption'!$P20/1000000,'Product benefit & adoption'!$G$4=\"2020-25\",'Product benefit & adoption'!AK20*'Product benefit & adoption'!$N20/1000000,'Product benefit & adoption'!$G$4=\"2015-20\",'Product benefit & adoption'!AK20*'Product benefit & adoption'!$L20/1000000)","v":0},{"$f":"_xlfn.IFS('Product benefit & adoption'!$G$4=\"ALL\",'Product benefit & adoption'!AL20*'Product benefit & adoption'!$P20/1000000,'Product benefit & adoption'!$G$4=\"2020-25\",'Product benefit & adoption'!AL20*'Product benefit & adoption'!$N20/1000000,'Product benefit & adoption'!$G$4=\"2015-20\",'Product benefit & adoption'!AL20*'Product benefit & adoption'!$L20/1000000)","v":0},{"$f":"_xlfn.IFS('Product benefit & adoption'!$G$4=\"ALL\",'Product benefit & adoption'!AM20*'Product benefit & adoption'!$P20/1000000,'Product benefit & adoption'!$G$4=\"2020-25\",'Product benefit & adoption'!AM20*'Product benefit & adoption'!$N20/1000000,'Product benefit & adoption'!$G$4=\"2015-20\",'Product benefit & adoption'!AM20*'Product benefit & adoption'!$L20/1000000)","v":0},{"$f":"_xlfn.IFS('Product benefit & adoption'!$G$4=\"ALL\",'Product benefit & adoption'!AN20*'Product benefit & adoption'!$P20/1000000,'Product benefit & adoption'!$G$4=\"2020-25\",'Product benefit & adoption'!AN20*'Product benefit & adoption'!$N20/1000000,'Product benefit & adoption'!$G$4=\"2015-20\",'Product benefit & adoption'!AN20*'Product benefit & adoption'!$L20/1000000)","v":0},{"$f":"_xlfn.IFS('Product benefit & adoption'!$G$4=\"ALL\",'Product benefit & adoption'!AO20*'Product benefit & adoption'!$P20/1000000,'Product benefit & adoption'!$G$4=\"2020-25\",'Product benefit & adoption'!AO20*'Product benefit & adoption'!$N20/1000000,'Product benefit & adoption'!$G$4=\"2015-20\",'Product benefit & adoption'!AO20*'Product benefit & adoption'!$L20/1000000)","v":0},{"$f":"_xlfn.IFS('Product benefit & adoption'!$G$4=\"ALL\",'Product benefit & adoption'!AP20*'Product benefit & adoption'!$P20/1000000,'Product benefit & adoption'!$G$4=\"2020-25\",'Product benefit & adoption'!AP20*'Product benefit & adoption'!$N20/1000000,'Product benefit & adoption'!$G$4=\"2015-20\",'Product benefit & adoption'!AP20*'Product benefit & adoption'!$L20/1000000)","v":0},{"$f":"_xlfn.IFS('Product benefit & adoption'!$G$4=\"ALL\",'Product benefit & adoption'!AQ20*'Product benefit & adoption'!$P20/1000000,'Product benefit & adoption'!$G$4=\"2020-25\",'Product benefit & adoption'!AQ20*'Product benefit & adoption'!$N20/1000000,'Product benefit & adoption'!$G$4=\"2015-20\",'Product benefit & adoption'!AQ20*'Product benefit & adoption'!$L20/1000000)","v":0},{"$f":"_xlfn.IFS('Product benefit & adoption'!$G$4=\"ALL\",'Product benefit & adoption'!AR20*'Product benefit & adoption'!$P20/1000000,'Product benefit & adoption'!$G$4=\"2020-25\",'Product benefit & adoption'!AR20*'Product benefit & adoption'!$N20/1000000,'Product benefit & adoption'!$G$4=\"2015-20\",'Product benefit & adoption'!AR20*'Product benefit & adoption'!$L20/1000000)","v":0},{"$f":"_xlfn.IFS('Product benefit & adoption'!$G$4=\"ALL\",'Product benefit & adoption'!AS20*'Product benefit & adoption'!$P20/1000000,'Product benefit & adoption'!$G$4=\"2020-25\",'Product benefit & adoption'!AS20*'Product benefit & adoption'!$N20/1000000,'Product benefit & adoption'!$G$4=\"2015-20\",'Product benefit & adoption'!AS20*'Product benefit & adoption'!$L20/1000000)","v":0},{"$f":"_xlfn.IFS('Product benefit & adoption'!$G$4=\"ALL\",'Product benefit & adoption'!AT20*'Product benefit & adoption'!$P20/1000000,'Product benefit & adoption'!$G$4=\"2020-25\",'Product benefit & adoption'!AT20*'Product benefit & adoption'!$N20/1000000,'Product benefit & adoption'!$G$4=\"2015-20\",'Product benefit & adoption'!AT20*'Product benefit & adoption'!$L20/1000000)","v":0},{"$f":"_xlfn.IFS('Product benefit & adoption'!$G$4=\"ALL\",'Product benefit & adoption'!AU20*'Product benefit & adoption'!$P20/1000000,'Product benefit & adoption'!$G$4=\"2020-25\",'Product benefit & adoption'!AU20*'Product benefit & adoption'!$N20/1000000,'Product benefit & adoption'!$G$4=\"2015-20\",'Product benefit & adoption'!AU20*'Product benefit & adoption'!$L20/1000000)","v":0},{"$f":"_xlfn.IFS('Product benefit & adoption'!$G$4=\"ALL\",'Product benefit & adoption'!AV20*'Product benefit & adoption'!$P20/1000000,'Product benefit & adoption'!$G$4=\"2020-25\",'Product benefit & adoption'!AV20*'Product benefit & adoption'!$N20/1000000,'Product benefit & adoption'!$G$4=\"2015-20\",'Product benefit & adoption'!AV20*'Product benefit & adoption'!$L20/1000000)","v":0},{"$f":"_xlfn.IFS('Product benefit & adoption'!$G$4=\"ALL\",'Product benefit & adoption'!AW20*'Product benefit & adoption'!$P20/1000000,'Product benefit & adoption'!$G$4=\"2020-25\",'Product benefit & adoption'!AW20*'Product benefit & adoption'!$N20/1000000,'Product benefit & adoption'!$G$4=\"2015-20\",'Product benefit & adoption'!AW20*'Product benefit & adoption'!$L20/1000000)","v":0},{"$f":"_xlfn.IFS('Product benefit & adoption'!$G$4=\"ALL\",'Product benefit & adoption'!AX20*'Product benefit & adoption'!$P20/1000000,'Product benefit & adoption'!$G$4=\"2020-25\",'Product benefit & adoption'!AX20*'Product benefit & adoption'!$N20/1000000,'Product benefit & adoption'!$G$4=\"2015-20\",'Product benefit & adoption'!AX20*'Product benefit & adoption'!$L20/1000000)","v":0},{"$f":"_xlfn.IFS('Product benefit & adoption'!$G$4=\"ALL\",'Product benefit & adoption'!AY20*'Product benefit & adoption'!$P20/1000000,'Product benefit & adoption'!$G$4=\"2020-25\",'Product benefit & adoption'!AY20*'Product benefit & adoption'!$N20/1000000,'Product benefit & adoption'!$G$4=\"2015-20\",'Product benefit & adoption'!AY20*'Product benefit & adoption'!$L20/1000000)","v":0},{"$f":"_xlfn.IFS('Product benefit & adoption'!$G$4=\"ALL\",'Product benefit & adoption'!AZ20*'Product benefit & adoption'!$P20/1000000,'Product benefit & adoption'!$G$4=\"2020-25\",'Product benefit & adoption'!AZ20*'Product benefit & adoption'!$N20/1000000,'Product benefit & adoption'!$G$4=\"2015-20\",'Product benefit & adoption'!AZ20*'Product benefit & adoption'!$L20/1000000)","v":0},{"$f":"_xlfn.IFS('Product benefit & adoption'!$G$4=\"ALL\",'Product benefit & adoption'!BA20*'Product benefit & adoption'!$P20/1000000,'Product benefit & adoption'!$G$4=\"2020-25\",'Product benefit & adoption'!BA20*'Product benefit & adoption'!$N20/1000000,'Product benefit & adoption'!$G$4=\"2015-20\",'Product benefit & adoption'!BA20*'Product benefit & adoption'!$L20/1000000)","v":0},{"$f":"_xlfn.IFS('Product benefit & adoption'!$G$4=\"ALL\",'Product benefit & adoption'!BB20*'Product benefit & adoption'!$P20/1000000,'Product benefit & adoption'!$G$4=\"2020-25\",'Product benefit & adoption'!BB20*'Product benefit & adoption'!$N20/1000000,'Product benefit & adoption'!$G$4=\"2015-20\",'Product benefit & adoption'!BB20*'Product benefit & adoption'!$L20/1000000)","v":0},{"$f":"_xlfn.IFS('Product benefit & adoption'!$G$4=\"ALL\",'Product benefit & adoption'!BC20*'Product benefit & adoption'!$P20/1000000,'Product benefit & adoption'!$G$4=\"2020-25\",'Product benefit & adoption'!BC20*'Product benefit & adoption'!$N20/1000000,'Product benefit & adoption'!$G$4=\"2015-20\",'Product benefit & adoption'!BC20*'Product benefit & adoption'!$L20/1000000)","v":0},{"$f":"_xlfn.IFS('Product benefit & adoption'!$G$4=\"ALL\",'Product benefit & adoption'!BD20*'Product benefit & adoption'!$P20/1000000,'Product benefit & adoption'!$G$4=\"2020-25\",'Product benefit & adoption'!BD20*'Product benefit & adoption'!$N20/1000000,'Product benefit & adoption'!$G$4=\"2015-20\",'Product benefit & adoption'!BD20*'Product benefit & adoption'!$L20/1000000)","v":0}]
[null,11,{"$f":"IF('Product benefit & adoption'!D21=\"\",\"\",'Product benefit & adoption'!D21)","v":""},{"$f":"IF('Product benefit & adoption'!F21=\"\",\"\",'Product benefit & adoption'!F21)","v":""},0,{"$f":"_xlfn.IFS('Product benefit & adoption'!$G$4=\"ALL\",'Product benefit & adoption'!AA21*'Product benefit & adoption'!$P21/1000000,'Product benefit & adoption'!$G$4=\"2020-25\",'Product benefit & adoption'!AA21*'Product benefit & adoption'!$N21/1000000,'Product benefit & adoption'!$G$4=\"2015-20\",'Product benefit & adoption'!AA21*'Product benefit & adoption'!$L21/1000000)","v":0},{"$f":"_xlfn.IFS('Product benefit & adoption'!$G$4=\"ALL\",'Product benefit & adoption'!AB21*'Product benefit & adoption'!$P21/1000000,'Product benefit & adoption'!$G$4=\"2020-25\",'Product benefit & adoption'!AB21*'Product benefit & adoption'!$N21/1000000,'Product benefit & adoption'!$G$4=\"2015-20\",'Product benefit & adoption'!AB21*'Product benefit & adoption'!$L21/1000000)","v":0},{"$f":"_xlfn.IFS('Product benefit & adoption'!$G$4=\"ALL\",'Product benefit & adoption'!AC21*'Product benefit & adoption'!$P21/1000000,'Product benefit & adoption'!$G$4=\"2020-25\",'Product benefit & adoption'!AC21*'Product benefit & adoption'!$N21/1000000,'Product benefit & adoption'!$G$4=\"2015-20\",'Product benefit & adoption'!AC21*'Product benefit & adoption'!$L21/1000000)","v":0},{"$f":"_xlfn.IFS('Product benefit & adoption'!$G$4=\"ALL\",'Product benefit & adoption'!AD21*'Product benefit & adoption'!$P21/1000000,'Product benefit & adoption'!$G$4=\"2020-25\",'Product benefit & adoption'!AD21*'Product benefit & adoption'!$N21/1000000,'Product benefit & adoption'!$G$4=\"2015-20\",'Product benefit & adoption'!AD21*'Product benefit & adoption'!$L21/1000000)","v":0},{"$f":"_xlfn.IFS('Product benefit & adoption'!$G$4=\"ALL\",'Product benefit & adoption'!AE21*'Product benefit & adoption'!$P21/1000000,'Product benefit & adoption'!$G$4=\"2020-25\",'Product benefit & adoption'!AE21*'Product benefit & adoption'!$N21/1000000,'Product benefit & adoption'!$G$4=\"2015-20\",'Product benefit & adoption'!AE21*'Product benefit & adoption'!$L21/1000000)","v":0},{"$f":"_xlfn.IFS('Product benefit & adoption'!$G$4=\"ALL\",'Product benefit & adoption'!AF21*'Product benefit & adoption'!$P21/1000000,'Product benefit & adoption'!$G$4=\"2020-25\",'Product benefit & adoption'!AF21*'Product benefit & adoption'!$N21/1000000,'Product benefit & adoption'!$G$4=\"2015-20\",'Product benefit & adoption'!AF21*'Product benefit & adoption'!$L21/1000000)","v":0},{"$f":"_xlfn.IFS('Product benefit & adoption'!$G$4=\"ALL\",'Product benefit & adoption'!AG21*'Product benefit & adoption'!$P21/1000000,'Product benefit & adoption'!$G$4=\"2020-25\",'Product benefit & adoption'!AG21*'Product benefit & adoption'!$N21/1000000,'Product benefit & adoption'!$G$4=\"2015-20\",'Product benefit & adoption'!AG21*'Product benefit & adoption'!$L21/1000000)","v":0},{"$f":"_xlfn.IFS('Product benefit & adoption'!$G$4=\"ALL\",'Product benefit & adoption'!AH21*'Product benefit & adoption'!$P21/1000000,'Product benefit & adoption'!$G$4=\"2020-25\",'Product benefit & adoption'!AH21*'Product benefit & adoption'!$N21/1000000,'Product benefit & adoption'!$G$4=\"2015-20\",'Product benefit & adoption'!AH21*'Product benefit & adoption'!$L21/1000000)","v":0},{"$f":"_xlfn.IFS('Product benefit & adoption'!$G$4=\"ALL\",'Product benefit & adoption'!AI21*'Product benefit & adoption'!$P21/1000000,'Product benefit & adoption'!$G$4=\"2020-25\",'Product benefit & adoption'!AI21*'Product benefit & adoption'!$N21/1000000,'Product benefit & adoption'!$G$4=\"2015-20\",'Product benefit & adoption'!AI21*'Product benefit & adoption'!$L21/1000000)","v":0},{"$f":"_xlfn.IFS('Product benefit & adoption'!$G$4=\"ALL\",'Product benefit & adoption'!AJ21*'Product benefit & adoption'!$P21/1000000,'Product benefit & adoption'!$G$4=\"2020-25\",'Product benefit & adoption'!AJ21*'Product benefit & adoption'!$N21/1000000,'Product benefit & adoption'!$G$4=\"2015-20\",'Product benefit & adoption'!AJ21*'Product benefit & adoption'!$L21/1000000)","v":0},{"$f":"_xlfn.IFS('Product benefit & adoption'!$G$4=\"ALL\",'Product benefit & adoption'!AK21*'Product benefit & adoption'!$P21/1000000,'Product benefit & adoption'!$G$4=\"2020-25\",'Product benefit & adoption'!AK21*'Product benefit & adoption'!$N21/1000000,'Product benefit & adoption'!$G$4=\"2015-20\",'Product benefit & adoption'!AK21*'Product benefit & adoption'!$L21/1000000)","v":0},{"$f":"_xlfn.IFS('Product benefit & adoption'!$G$4=\"ALL\",'Product benefit & adoption'!AL21*'Product benefit & adoption'!$P21/1000000,'Product benefit & adoption'!$G$4=\"2020-25\",'Product benefit & adoption'!AL21*'Product benefit & adoption'!$N21/1000000,'Product benefit & adoption'!$G$4=\"2015-20\",'Product benefit & adoption'!AL21*'Product benefit & adoption'!$L21/1000000)","v":0},{"$f":"_xlfn.IFS('Product benefit & adoption'!$G$4=\"ALL\",'Product benefit & adoption'!AM21*'Product benefit & adoption'!$P21/1000000,'Product benefit & adoption'!$G$4=\"2020-25\",'Product benefit & adoption'!AM21*'Product benefit & adoption'!$N21/1000000,'Product benefit & adoption'!$G$4=\"2015-20\",'Product benefit & adoption'!AM21*'Product benefit & adoption'!$L21/1000000)","v":0},{"$f":"_xlfn.IFS('Product benefit & adoption'!$G$4=\"ALL\",'Product benefit & adoption'!AN21*'Product benefit & adoption'!$P21/1000000,'Product benefit & adoption'!$G$4=\"2020-25\",'Product benefit & adoption'!AN21*'Product benefit & adoption'!$N21/1000000,'Product benefit & adoption'!$G$4=\"2015-20\",'Product benefit & adoption'!AN21*'Product benefit & adoption'!$L21/1000000)","v":0},{"$f":"_xlfn.IFS('Product benefit & adoption'!$G$4=\"ALL\",'Product benefit & adoption'!AO21*'Product benefit & adoption'!$P21/1000000,'Product benefit & adoption'!$G$4=\"2020-25\",'Product benefit & adoption'!AO21*'Product benefit & adoption'!$N21/1000000,'Product benefit & adoption'!$G$4=\"2015-20\",'Product benefit & adoption'!AO21*'Product benefit & adoption'!$L21/1000000)","v":0},{"$f":"_xlfn.IFS('Product benefit & adoption'!$G$4=\"ALL\",'Product benefit & adoption'!AP21*'Product benefit & adoption'!$P21/1000000,'Product benefit & adoption'!$G$4=\"2020-25\",'Product benefit & adoption'!AP21*'Product benefit & adoption'!$N21/1000000,'Product benefit & adoption'!$G$4=\"2015-20\",'Product benefit & adoption'!AP21*'Product benefit & adoption'!$L21/1000000)","v":0},{"$f":"_xlfn.IFS('Product benefit & adoption'!$G$4=\"ALL\",'Product benefit & adoption'!AQ21*'Product benefit & adoption'!$P21/1000000,'Product benefit & adoption'!$G$4=\"2020-25\",'Product benefit & adoption'!AQ21*'Product benefit & adoption'!$N21/1000000,'Product benefit & adoption'!$G$4=\"2015-20\",'Product benefit & adoption'!AQ21*'Product benefit & adoption'!$L21/1000000)","v":0},{"$f":"_xlfn.IFS('Product benefit & adoption'!$G$4=\"ALL\",'Product benefit & adoption'!AR21*'Product benefit & adoption'!$P21/1000000,'Product benefit & adoption'!$G$4=\"2020-25\",'Product benefit & adoption'!AR21*'Product benefit & adoption'!$N21/1000000,'Product benefit & adoption'!$G$4=\"2015-20\",'Product benefit & adoption'!AR21*'Product benefit & adoption'!$L21/1000000)","v":0},{"$f":"_xlfn.IFS('Product benefit & adoption'!$G$4=\"ALL\",'Product benefit & adoption'!AS21*'Product benefit & adoption'!$P21/1000000,'Product benefit & adoption'!$G$4=\"2020-25\",'Product benefit & adoption'!AS21*'Product benefit & adoption'!$N21/1000000,'Product benefit & adoption'!$G$4=\"2015-20\",'Product benefit & adoption'!AS21*'Product benefit & adoption'!$L21/1000000)","v":0},{"$f":"_xlfn.IFS('Product benefit & adoption'!$G$4=\"ALL\",'Product benefit & adoption'!AT21*'Product benefit & adoption'!$P21/1000000,'Product benefit & adoption'!$G$4=\"2020-25\",'Product benefit & adoption'!AT21*'Product benefit & adoption'!$N21/1000000,'Product benefit & adoption'!$G$4=\"2015-20\",'Product benefit & adoption'!AT21*'Product benefit & adoption'!$L21/1000000)","v":0},{"$f":"_xlfn.IFS('Product benefit & adoption'!$G$4=\"ALL\",'Product benefit & adoption'!AU21*'Product benefit & adoption'!$P21/1000000,'Product benefit & adoption'!$G$4=\"2020-25\",'Product benefit & adoption'!AU21*'Product benefit & adoption'!$N21/1000000,'Product benefit & adoption'!$G$4=\"2015-20\",'Product benefit & adoption'!AU21*'Product benefit & adoption'!$L21/1000000)","v":0},{"$f":"_xlfn.IFS('Product benefit & adoption'!$G$4=\"ALL\",'Product benefit & adoption'!AV21*'Product benefit & adoption'!$P21/1000000,'Product benefit & adoption'!$G$4=\"2020-25\",'Product benefit & adoption'!AV21*'Product benefit & adoption'!$N21/1000000,'Product benefit & adoption'!$G$4=\"2015-20\",'Product benefit & adoption'!AV21*'Product benefit & adoption'!$L21/1000000)","v":0},{"$f":"_xlfn.IFS('Product benefit & adoption'!$G$4=\"ALL\",'Product benefit & adoption'!AW21*'Product benefit & adoption'!$P21/1000000,'Product benefit & adoption'!$G$4=\"2020-25\",'Product benefit & adoption'!AW21*'Product benefit & adoption'!$N21/1000000,'Product benefit & adoption'!$G$4=\"2015-20\",'Product benefit & adoption'!AW21*'Product benefit & adoption'!$L21/1000000)","v":0},{"$f":"_xlfn.IFS('Product benefit & adoption'!$G$4=\"ALL\",'Product benefit & adoption'!AX21*'Product benefit & adoption'!$P21/1000000,'Product benefit & adoption'!$G$4=\"2020-25\",'Product benefit & adoption'!AX21*'Product benefit & adoption'!$N21/1000000,'Product benefit & adoption'!$G$4=\"2015-20\",'Product benefit & adoption'!AX21*'Product benefit & adoption'!$L21/1000000)","v":0},{"$f":"_xlfn.IFS('Product benefit & adoption'!$G$4=\"ALL\",'Product benefit & adoption'!AY21*'Product benefit & adoption'!$P21/1000000,'Product benefit & adoption'!$G$4=\"2020-25\",'Product benefit & adoption'!AY21*'Product benefit & adoption'!$N21/1000000,'Product benefit & adoption'!$G$4=\"2015-20\",'Product benefit & adoption'!AY21*'Product benefit & adoption'!$L21/1000000)","v":0},{"$f":"_xlfn.IFS('Product benefit & adoption'!$G$4=\"ALL\",'Product benefit & adoption'!AZ21*'Product benefit & adoption'!$P21/1000000,'Product benefit & adoption'!$G$4=\"2020-25\",'Product benefit & adoption'!AZ21*'Product benefit & adoption'!$N21/1000000,'Product benefit & adoption'!$G$4=\"2015-20\",'Product benefit & adoption'!AZ21*'Product benefit & adoption'!$L21/1000000)","v":0},{"$f":"_xlfn.IFS('Product benefit & adoption'!$G$4=\"ALL\",'Product benefit & adoption'!BA21*'Product benefit & adoption'!$P21/1000000,'Product benefit & adoption'!$G$4=\"2020-25\",'Product benefit & adoption'!BA21*'Product benefit & adoption'!$N21/1000000,'Product benefit & adoption'!$G$4=\"2015-20\",'Product benefit & adoption'!BA21*'Product benefit & adoption'!$L21/1000000)","v":0},{"$f":"_xlfn.IFS('Product benefit & adoption'!$G$4=\"ALL\",'Product benefit & adoption'!BB21*'Product benefit & adoption'!$P21/1000000,'Product benefit & adoption'!$G$4=\"2020-25\",'Product benefit & adoption'!BB21*'Product benefit & adoption'!$N21/1000000,'Product benefit & adoption'!$G$4=\"2015-20\",'Product benefit & adoption'!BB21*'Product benefit & adoption'!$L21/1000000)","v":0},{"$f":"_xlfn.IFS('Product benefit & adoption'!$G$4=\"ALL\",'Product benefit & adoption'!BC21*'Product benefit & adoption'!$P21/1000000,'Product benefit & adoption'!$G$4=\"2020-25\",'Product benefit & adoption'!BC21*'Product benefit & adoption'!$N21/1000000,'Product benefit & adoption'!$G$4=\"2015-20\",'Product benefit & adoption'!BC21*'Product benefit & adoption'!$L21/1000000)","v":0},{"$f":"_xlfn.IFS('Product benefit & adoption'!$G$4=\"ALL\",'Product benefit & adoption'!BD21*'Product benefit & adoption'!$P21/1000000,'Product benefit & adoption'!$G$4=\"2020-25\",'Product benefit & adoption'!BD21*'Product benefit & adoption'!$N21/1000000,'Product benefit & adoption'!$G$4=\"2015-20\",'Product benefit & adoption'!BD21*'Product benefit & adoption'!$L21/1000000)","v":0}]
[null,12,{"$f":"IF('Product benefit & adoption'!D22=\"\",\"\",'Product benefit & adoption'!D22)","v":""},{"$f":"IF('Product benefit & adoption'!F22=\"\",\"\",'Product benefit & adoption'!F22)","v":""},0,{"$f":"_xlfn.IFS('Product benefit & adoption'!$G$4=\"ALL\",'Product benefit & adoption'!AA22*'Product benefit & adoption'!$P22/1000000,'Product benefit & adoption'!$G$4=\"2020-25\",'Product benefit & adoption'!AA22*'Product benefit & adoption'!$N22/1000000,'Product benefit & adoption'!$G$4=\"2015-20\",'Product benefit & adoption'!AA22*'Product benefit & adoption'!$L22/1000000)","v":0},{"$f":"_xlfn.IFS('Product benefit & adoption'!$G$4=\"ALL\",'Product benefit & adoption'!AB22*'Product benefit & adoption'!$P22/1000000,'Product benefit & adoption'!$G$4=\"2020-25\",'Product benefit & adoption'!AB22*'Product benefit & adoption'!$N22/1000000,'Product benefit & adoption'!$G$4=\"2015-20\",'Product benefit & adoption'!AB22*'Product benefit & adoption'!$L22/1000000)","v":0},{"$f":"_xlfn.IFS('Product benefit & adoption'!$G$4=\"ALL\",'Product benefit & adoption'!AC22*'Product benefit & adoption'!$P22/1000000,'Product benefit & adoption'!$G$4=\"2020-25\",'Product benefit & adoption'!AC22*'Product benefit & adoption'!$N22/1000000,'Product benefit & adoption'!$G$4=\"2015-20\",'Product benefit & adoption'!AC22*'Product benefit & adoption'!$L22/1000000)","v":0},{"$f":"_xlfn.IFS('Product benefit & adoption'!$G$4=\"ALL\",'Product benefit & adoption'!AD22*'Product benefit & adoption'!$P22/1000000,'Product benefit & adoption'!$G$4=\"2020-25\",'Product benefit & adoption'!AD22*'Product benefit & adoption'!$N22/1000000,'Product benefit & adoption'!$G$4=\"2015-20\",'Product benefit & adoption'!AD22*'Product benefit & adoption'!$L22/1000000)","v":0},{"$f":"_xlfn.IFS('Product benefit & adoption'!$G$4=\"ALL\",'Product benefit & adoption'!AE22*'Product benefit & adoption'!$P22/1000000,'Product benefit & adoption'!$G$4=\"2020-25\",'Product benefit & adoption'!AE22*'Product benefit & adoption'!$N22/1000000,'Product benefit & adoption'!$G$4=\"2015-20\",'Product benefit & adoption'!AE22*'Product benefit & adoption'!$L22/1000000)","v":0},{"$f":"_xlfn.IFS('Product benefit & adoption'!$G$4=\"ALL\",'Product benefit & adoption'!AF22*'Product benefit & adoption'!$P22/1000000,'Product benefit & adoption'!$G$4=\"2020-25\",'Product benefit & adoption'!AF22*'Product benefit & adoption'!$N22/1000000,'Product benefit & adoption'!$G$4=\"2015-20\",'Product benefit & adoption'!AF22*'Product benefit & adoption'!$L22/1000000)","v":0},{"$f":"_xlfn.IFS('Product benefit & adoption'!$G$4=\"ALL\",'Product benefit & adoption'!AG22*'Product benefit & adoption'!$P22/1000000,'Product benefit & adoption'!$G$4=\"2020-25\",'Product benefit & adoption'!AG22*'Product benefit & adoption'!$N22/1000000,'Product benefit & adoption'!$G$4=\"2015-20\",'Product benefit & adoption'!AG22*'Product benefit & adoption'!$L22/1000000)","v":0},{"$f":"_xlfn.IFS('Product benefit & adoption'!$G$4=\"ALL\",'Product benefit & adoption'!AH22*'Product benefit & adoption'!$P22/1000000,'Product benefit & adoption'!$G$4=\"2020-25\",'Product benefit & adoption'!AH22*'Product benefit & adoption'!$N22/1000000,'Product benefit & adoption'!$G$4=\"2015-20\",'Product benefit & adoption'!AH22*'Product benefit & adoption'!$L22/1000000)","v":0},{"$f":"_xlfn.IFS('Product benefit & adoption'!$G$4=\"ALL\",'Product benefit & adoption'!AI22*'Product benefit & adoption'!$P22/1000000,'Product benefit & adoption'!$G$4=\"2020-25\",'Product benefit & adoption'!AI22*'Product benefit & adoption'!$N22/1000000,'Product benefit & adoption'!$G$4=\"2015-20\",'Product benefit & adoption'!AI22*'Product benefit & adoption'!$L22/1000000)","v":0},{"$f":"_xlfn.IFS('Product benefit & adoption'!$G$4=\"ALL\",'Product benefit & adoption'!AJ22*'Product benefit & adoption'!$P22/1000000,'Product benefit & adoption'!$G$4=\"2020-25\",'Product benefit & adoption'!AJ22*'Product benefit & adoption'!$N22/1000000,'Product benefit & adoption'!$G$4=\"2015-20\",'Product benefit & adoption'!AJ22*'Product benefit & adoption'!$L22/1000000)","v":0},{"$f":"_xlfn.IFS('Product benefit & adoption'!$G$4=\"ALL\",'Product benefit & adoption'!AK22*'Product benefit & adoption'!$P22/1000000,'Product benefit & adoption'!$G$4=\"2020-25\",'Product benefit & adoption'!AK22*'Product benefit & adoption'!$N22/1000000,'Product benefit & adoption'!$G$4=\"2015-20\",'Product benefit & adoption'!AK22*'Product benefit & adoption'!$L22/1000000)","v":0},{"$f":"_xlfn.IFS('Product benefit & adoption'!$G$4=\"ALL\",'Product benefit & adoption'!AL22*'Product benefit & adoption'!$P22/1000000,'Product benefit & adoption'!$G$4=\"2020-25\",'Product benefit & adoption'!AL22*'Product benefit & adoption'!$N22/1000000,'Product benefit & adoption'!$G$4=\"2015-20\",'Product benefit & adoption'!AL22*'Product benefit & adoption'!$L22/1000000)","v":0},{"$f":"_xlfn.IFS('Product benefit & adoption'!$G$4=\"ALL\",'Product benefit & adoption'!AM22*'Product benefit & adoption'!$P22/1000000,'Product benefit & adoption'!$G$4=\"2020-25\",'Product benefit & adoption'!AM22*'Product benefit & adoption'!$N22/1000000,'Product benefit & adoption'!$G$4=\"2015-20\",'Product benefit & adoption'!AM22*'Product benefit & adoption'!$L22/1000000)","v":0},{"$f":"_xlfn.IFS('Product benefit & adoption'!$G$4=\"ALL\",'Product benefit & adoption'!AN22*'Product benefit & adoption'!$P22/1000000,'Product benefit & adoption'!$G$4=\"2020-25\",'Product benefit & adoption'!AN22*'Product benefit & adoption'!$N22/1000000,'Product benefit & adoption'!$G$4=\"2015-20\",'Product benefit & adoption'!AN22*'Product benefit & adoption'!$L22/1000000)","v":0},{"$f":"_xlfn.IFS('Product benefit & adoption'!$G$4=\"ALL\",'Product benefit & adoption'!AO22*'Product benefit & adoption'!$P22/1000000,'Product benefit & adoption'!$G$4=\"2020-25\",'Product benefit & adoption'!AO22*'Product benefit & adoption'!$N22/1000000,'Product benefit & adoption'!$G$4=\"2015-20\",'Product benefit & adoption'!AO22*'Product benefit & adoption'!$L22/1000000)","v":0},{"$f":"_xlfn.IFS('Product benefit & adoption'!$G$4=\"ALL\",'Product benefit & adoption'!AP22*'Product benefit & adoption'!$P22/1000000,'Product benefit & adoption'!$G$4=\"2020-25\",'Product benefit & adoption'!AP22*'Product benefit & adoption'!$N22/1000000,'Product benefit & adoption'!$G$4=\"2015-20\",'Product benefit & adoption'!AP22*'Product benefit & adoption'!$L22/1000000)","v":0},{"$f":"_xlfn.IFS('Product benefit & adoption'!$G$4=\"ALL\",'Product benefit & adoption'!AQ22*'Product benefit & adoption'!$P22/1000000,'Product benefit & adoption'!$G$4=\"2020-25\",'Product benefit & adoption'!AQ22*'Product benefit & adoption'!$N22/1000000,'Product benefit & adoption'!$G$4=\"2015-20\",'Product benefit & adoption'!AQ22*'Product benefit & adoption'!$L22/1000000)","v":0},{"$f":"_xlfn.IFS('Product benefit & adoption'!$G$4=\"ALL\",'Product benefit & adoption'!AR22*'Product benefit & adoption'!$P22/1000000,'Product benefit & adoption'!$G$4=\"2020-25\",'Product benefit & adoption'!AR22*'Product benefit & adoption'!$N22/1000000,'Product benefit & adoption'!$G$4=\"2015-20\",'Product benefit & adoption'!AR22*'Product benefit & adoption'!$L22/1000000)","v":0},{"$f":"_xlfn.IFS('Product benefit & adoption'!$G$4=\"ALL\",'Product benefit & adoption'!AS22*'Product benefit & adoption'!$P22/1000000,'Product benefit & adoption'!$G$4=\"2020-25\",'Product benefit & adoption'!AS22*'Product benefit & adoption'!$N22/1000000,'Product benefit & adoption'!$G$4=\"2015-20\",'Product benefit & adoption'!AS22*'Product benefit & adoption'!$L22/1000000)","v":0},{"$f":"_xlfn.IFS('Product benefit & adoption'!$G$4=\"ALL\",'Product benefit & adoption'!AT22*'Product benefit & adoption'!$P22/1000000,'Product benefit & adoption'!$G$4=\"2020-25\",'Product benefit & adoption'!AT22*'Product benefit & adoption'!$N22/1000000,'Product benefit & adoption'!$G$4=\"2015-20\",'Product benefit & adoption'!AT22*'Product benefit & adoption'!$L22/1000000)","v":0},{"$f":"_xlfn.IFS('Product benefit & adoption'!$G$4=\"ALL\",'Product benefit & adoption'!AU22*'Product benefit & adoption'!$P22/1000000,'Product benefit & adoption'!$G$4=\"2020-25\",'Product benefit & adoption'!AU22*'Product benefit & adoption'!$N22/1000000,'Product benefit & adoption'!$G$4=\"2015-20\",'Product benefit & adoption'!AU22*'Product benefit & adoption'!$L22/1000000)","v":0},{"$f":"_xlfn.IFS('Product benefit & adoption'!$G$4=\"ALL\",'Product benefit & adoption'!AV22*'Product benefit & adoption'!$P22/1000000,'Product benefit & adoption'!$G$4=\"2020-25\",'Product benefit & adoption'!AV22*'Product benefit & adoption'!$N22/1000000,'Product benefit & adoption'!$G$4=\"2015-20\",'Product benefit & adoption'!AV22*'Product benefit & adoption'!$L22/1000000)","v":0},{"$f":"_xlfn.IFS('Product benefit & adoption'!$G$4=\"ALL\",'Product benefit & adoption'!AW22*'Product benefit & adoption'!$P22/1000000,'Product benefit & adoption'!$G$4=\"2020-25\",'Product benefit & adoption'!AW22*'Product benefit & adoption'!$N22/1000000,'Product benefit & adoption'!$G$4=\"2015-20\",'Product benefit & adoption'!AW22*'Product benefit & adoption'!$L22/1000000)","v":0},{"$f":"_xlfn.IFS('Product benefit & adoption'!$G$4=\"ALL\",'Product benefit & adoption'!AX22*'Product benefit & adoption'!$P22/1000000,'Product benefit & adoption'!$G$4=\"2020-25\",'Product benefit & adoption'!AX22*'Product benefit & adoption'!$N22/1000000,'Product benefit & adoption'!$G$4=\"2015-20\",'Product benefit & adoption'!AX22*'Product benefit & adoption'!$L22/1000000)","v":0},{"$f":"_xlfn.IFS('Product benefit & adoption'!$G$4=\"ALL\",'Product benefit & adoption'!AY22*'Product benefit & adoption'!$P22/1000000,'Product benefit & adoption'!$G$4=\"2020-25\",'Product benefit & adoption'!AY22*'Product benefit & adoption'!$N22/1000000,'Product benefit & adoption'!$G$4=\"2015-20\",'Product benefit & adoption'!AY22*'Product benefit & adoption'!$L22/1000000)","v":0},{"$f":"_xlfn.IFS('Product benefit & adoption'!$G$4=\"ALL\",'Product benefit & adoption'!AZ22*'Product benefit & adoption'!$P22/1000000,'Product benefit & adoption'!$G$4=\"2020-25\",'Product benefit & adoption'!AZ22*'Product benefit & adoption'!$N22/1000000,'Product benefit & adoption'!$G$4=\"2015-20\",'Product benefit & adoption'!AZ22*'Product benefit & adoption'!$L22/1000000)","v":0},{"$f":"_xlfn.IFS('Product benefit & adoption'!$G$4=\"ALL\",'Product benefit & adoption'!BA22*'Product benefit & adoption'!$P22/1000000,'Product benefit & adoption'!$G$4=\"2020-25\",'Product benefit & adoption'!BA22*'Product benefit & adoption'!$N22/1000000,'Product benefit & adoption'!$G$4=\"2015-20\",'Product benefit & adoption'!BA22*'Product benefit & adoption'!$L22/1000000)","v":0},{"$f":"_xlfn.IFS('Product benefit & adoption'!$G$4=\"ALL\",'Product benefit & adoption'!BB22*'Product benefit & adoption'!$P22/1000000,'Product benefit & adoption'!$G$4=\"2020-25\",'Product benefit & adoption'!BB22*'Product benefit & adoption'!$N22/1000000,'Product benefit & adoption'!$G$4=\"2015-20\",'Product benefit & adoption'!BB22*'Product benefit & adoption'!$L22/1000000)","v":0},{"$f":"_xlfn.IFS('Product benefit & adoption'!$G$4=\"ALL\",'Product benefit & adoption'!BC22*'Product benefit & adoption'!$P22/1000000,'Product benefit & adoption'!$G$4=\"2020-25\",'Product benefit & adoption'!BC22*'Product benefit & adoption'!$N22/1000000,'Product benefit & adoption'!$G$4=\"2015-20\",'Product benefit & adoption'!BC22*'Product benefit & adoption'!$L22/1000000)","v":0},{"$f":"_xlfn.IFS('Product benefit & adoption'!$G$4=\"ALL\",'Product benefit & adoption'!BD22*'Product benefit & adoption'!$P22/1000000,'Product benefit & adoption'!$G$4=\"2020-25\",'Product benefit & adoption'!BD22*'Product benefit & adoption'!$N22/1000000,'Product benefit & adoption'!$G$4=\"2015-20\",'Product benefit & adoption'!BD22*'Product benefit & adoption'!$L22/1000000)","v":0}]
[null,13,{"$f":"IF('Product benefit & adoption'!D23=\"\",\"\",'Product benefit & adoption'!D23)","v":""},{"$f":"IF('Product benefit & adoption'!F23=\"\",\"\",'Product benefit & adoption'!F23)","v":""},0,{"$f":"_xlfn.IFS('Product benefit & adoption'!$G$4=\"ALL\",'Product benefit & adoption'!AA23*'Product benefit & adoption'!$P23/1000000,'Product benefit & adoption'!$G$4=\"2020-25\",'Product benefit & adoption'!AA23*'Product benefit & adoption'!$N23/1000000,'Product benefit & adoption'!$G$4=\"2015-20\",'Product benefit & adoption'!AA23*'Product benefit & adoption'!$L23/1000000)","v":0},{"$f":"_xlfn.IFS('Product benefit & adoption'!$G$4=\"ALL\",'Product benefit & adoption'!AB23*'Product benefit & adoption'!$P23/1000000,'Product benefit & adoption'!$G$4=\"2020-25\",'Product benefit & adoption'!AB23*'Product benefit & adoption'!$N23/1000000,'Product benefit & adoption'!$G$4=\"2015-20\",'Product benefit & adoption'!AB23*'Product benefit & adoption'!$L23/1000000)","v":0},{"$f":"_xlfn.IFS('Product benefit & adoption'!$G$4=\"ALL\",'Product benefit & adoption'!AC23*'Product benefit & adoption'!$P23/1000000,'Product benefit & adoption'!$G$4=\"2020-25\",'Product benefit & adoption'!AC23*'Product benefit & adoption'!$N23/1000000,'Product benefit & adoption'!$G$4=\"2015-20\",'Product benefit & adoption'!AC23*'Product benefit & adoption'!$L23/1000000)","v":0},{"$f":"_xlfn.IFS('Product benefit & adoption'!$G$4=\"ALL\",'Product benefit & adoption'!AD23*'Product benefit & adoption'!$P23/1000000,'Product benefit & adoption'!$G$4=\"2020-25\",'Product benefit & adoption'!AD23*'Product benefit & adoption'!$N23/1000000,'Product benefit & adoption'!$G$4=\"2015-20\",'Product benefit & adoption'!AD23*'Product benefit & adoption'!$L23/1000000)","v":0},{"$f":"_xlfn.IFS('Product benefit & adoption'!$G$4=\"ALL\",'Product benefit & adoption'!AE23*'Product benefit & adoption'!$P23/1000000,'Product benefit & adoption'!$G$4=\"2020-25\",'Product benefit & adoption'!AE23*'Product benefit & adoption'!$N23/1000000,'Product benefit & adoption'!$G$4=\"2015-20\",'Product benefit & adoption'!AE23*'Product benefit & adoption'!$L23/1000000)","v":0},{"$f":"_xlfn.IFS('Product benefit & adoption'!$G$4=\"ALL\",'Product benefit & adoption'!AF23*'Product benefit & adoption'!$P23/1000000,'Product benefit & adoption'!$G$4=\"2020-25\",'Product benefit & adoption'!AF23*'Product benefit & adoption'!$N23/1000000,'Product benefit & adoption'!$G$4=\"2015-20\",'Product benefit & adoption'!AF23*'Product benefit & adoption'!$L23/1000000)","v":0},{"$f":"_xlfn.IFS('Product benefit & adoption'!$G$4=\"ALL\",'Product benefit & adoption'!AG23*'Product benefit & adoption'!$P23/1000000,'Product benefit & adoption'!$G$4=\"2020-25\",'Product benefit & adoption'!AG23*'Product benefit & adoption'!$N23/1000000,'Product benefit & adoption'!$G$4=\"2015-20\",'Product benefit & adoption'!AG23*'Product benefit & adoption'!$L23/1000000)","v":0},{"$f":"_xlfn.IFS('Product benefit & adoption'!$G$4=\"ALL\",'Product benefit & adoption'!AH23*'Product benefit & adoption'!$P23/1000000,'Product benefit & adoption'!$G$4=\"2020-25\",'Product benefit & adoption'!AH23*'Product benefit & adoption'!$N23/1000000,'Product benefit & adoption'!$G$4=\"2015-20\",'Product benefit & adoption'!AH23*'Product benefit & adoption'!$L23/1000000)","v":0},{"$f":"_xlfn.IFS('Product benefit & adoption'!$G$4=\"ALL\",'Product benefit & adoption'!AI23*'Product benefit & adoption'!$P23/1000000,'Product benefit & adoption'!$G$4=\"2020-25\",'Product benefit & adoption'!AI23*'Product benefit & adoption'!$N23/1000000,'Product benefit & adoption'!$G$4=\"2015-20\",'Product benefit & adoption'!AI23*'Product benefit & adoption'!$L23/1000000)","v":0},{"$f":"_xlfn.IFS('Product benefit & adoption'!$G$4=\"ALL\",'Product benefit & adoption'!AJ23*'Product benefit & adoption'!$P23/1000000,'Product benefit & adoption'!$G$4=\"2020-25\",'Product benefit & adoption'!AJ23*'Product benefit & adoption'!$N23/1000000,'Product benefit & adoption'!$G$4=\"2015-20\",'Product benefit & adoption'!AJ23*'Product benefit & adoption'!$L23/1000000)","v":0},{"$f":"_xlfn.IFS('Product benefit & adoption'!$G$4=\"ALL\",'Product benefit & adoption'!AK23*'Product benefit & adoption'!$P23/1000000,'Product benefit & adoption'!$G$4=\"2020-25\",'Product benefit & adoption'!AK23*'Product benefit & adoption'!$N23/1000000,'Product benefit & adoption'!$G$4=\"2015-20\",'Product benefit & adoption'!AK23*'Product benefit & adoption'!$L23/1000000)","v":0},{"$f":"_xlfn.IFS('Product benefit & adoption'!$G$4=\"ALL\",'Product benefit & adoption'!AL23*'Product benefit & adoption'!$P23/1000000,'Product benefit & adoption'!$G$4=\"2020-25\",'Product benefit & adoption'!AL23*'Product benefit & adoption'!$N23/1000000,'Product benefit & adoption'!$G$4=\"2015-20\",'Product benefit & adoption'!AL23*'Product benefit & adoption'!$L23/1000000)","v":0},{"$f":"_xlfn.IFS('Product benefit & adoption'!$G$4=\"ALL\",'Product benefit & adoption'!AM23*'Product benefit & adoption'!$P23/1000000,'Product benefit & adoption'!$G$4=\"2020-25\",'Product benefit & adoption'!AM23*'Product benefit & adoption'!$N23/1000000,'Product benefit & adoption'!$G$4=\"2015-20\",'Product benefit & adoption'!AM23*'Product benefit & adoption'!$L23/1000000)","v":0},{"$f":"_xlfn.IFS('Product benefit & adoption'!$G$4=\"ALL\",'Product benefit & adoption'!AN23*'Product benefit & adoption'!$P23/1000000,'Product benefit & adoption'!$G$4=\"2020-25\",'Product benefit & adoption'!AN23*'Product benefit & adoption'!$N23/1000000,'Product benefit & adoption'!$G$4=\"2015-20\",'Product benefit & adoption'!AN23*'Product benefit & adoption'!$L23/1000000)","v":0},{"$f":"_xlfn.IFS('Product benefit & adoption'!$G$4=\"ALL\",'Product benefit & adoption'!AO23*'Product benefit & adoption'!$P23/1000000,'Product benefit & adoption'!$G$4=\"2020-25\",'Product benefit & adoption'!AO23*'Product benefit & adoption'!$N23/1000000,'Product benefit & adoption'!$G$4=\"2015-20\",'Product benefit & adoption'!AO23*'Product benefit & adoption'!$L23/1000000)","v":0},{"$f":"_xlfn.IFS('Product benefit & adoption'!$G$4=\"ALL\",'Product benefit & adoption'!AP23*'Product benefit & adoption'!$P23/1000000,'Product benefit & adoption'!$G$4=\"2020-25\",'Product benefit & adoption'!AP23*'Product benefit & adoption'!$N23/1000000,'Product benefit & adoption'!$G$4=\"2015-20\",'Product benefit & adoption'!AP23*'Product benefit & adoption'!$L23/1000000)","v":0},{"$f":"_xlfn.IFS('Product benefit & adoption'!$G$4=\"ALL\",'Product benefit & adoption'!AQ23*'Product benefit & adoption'!$P23/1000000,'Product benefit & adoption'!$G$4=\"2020-25\",'Product benefit & adoption'!AQ23*'Product benefit & adoption'!$N23/1000000,'Product benefit & adoption'!$G$4=\"2015-20\",'Product benefit & adoption'!AQ23*'Product benefit & adoption'!$L23/1000000)","v":0},{"$f":"_xlfn.IFS('Product benefit & adoption'!$G$4=\"ALL\",'Product benefit & adoption'!AR23*'Product benefit & adoption'!$P23/1000000,'Product benefit & adoption'!$G$4=\"2020-25\",'Product benefit & adoption'!AR23*'Product benefit & adoption'!$N23/1000000,'Product benefit & adoption'!$G$4=\"2015-20\",'Product benefit & adoption'!AR23*'Product benefit & adoption'!$L23/1000000)","v":0},{"$f":"_xlfn.IFS('Product benefit & adoption'!$G$4=\"ALL\",'Product benefit & adoption'!AS23*'Product benefit & adoption'!$P23/1000000,'Product benefit & adoption'!$G$4=\"2020-25\",'Product benefit & adoption'!AS23*'Product benefit & adoption'!$N23/1000000,'Product benefit & adoption'!$G$4=\"2015-20\",'Product benefit & adoption'!AS23*'Product benefit & adoption'!$L23/1000000)","v":0},{"$f":"_xlfn.IFS('Product benefit & adoption'!$G$4=\"ALL\",'Product benefit & adoption'!AT23*'Product benefit & adoption'!$P23/1000000,'Product benefit & adoption'!$G$4=\"2020-25\",'Product benefit & adoption'!AT23*'Product benefit & adoption'!$N23/1000000,'Product benefit & adoption'!$G$4=\"2015-20\",'Product benefit & adoption'!AT23*'Product benefit & adoption'!$L23/1000000)","v":0},{"$f":"_xlfn.IFS('Product benefit & adoption'!$G$4=\"ALL\",'Product benefit & adoption'!AU23*'Product benefit & adoption'!$P23/1000000,'Product benefit & adoption'!$G$4=\"2020-25\",'Product benefit & adoption'!AU23*'Product benefit & adoption'!$N23/1000000,'Product benefit & adoption'!$G$4=\"2015-20\",'Product benefit & adoption'!AU23*'Product benefit & adoption'!$L23/1000000)","v":0},{"$f":"_xlfn.IFS('Product benefit & adoption'!$G$4=\"ALL\",'Product benefit & adoption'!AV23*'Product benefit & adoption'!$P23/1000000,'Product benefit & adoption'!$G$4=\"2020-25\",'Product benefit & adoption'!AV23*'Product benefit & adoption'!$N23/1000000,'Product benefit & adoption'!$G$4=\"2015-20\",'Product benefit & adoption'!AV23*'Product benefit & adoption'!$L23/1000000)","v":0},{"$f":"_xlfn.IFS('Product benefit & adoption'!$G$4=\"ALL\",'Product benefit & adoption'!AW23*'Product benefit & adoption'!$P23/1000000,'Product benefit & adoption'!$G$4=\"2020-25\",'Product benefit & adoption'!AW23*'Product benefit & adoption'!$N23/1000000,'Product benefit & adoption'!$G$4=\"2015-20\",'Product benefit & adoption'!AW23*'Product benefit & adoption'!$L23/1000000)","v":0},{"$f":"_xlfn.IFS('Product benefit & adoption'!$G$4=\"ALL\",'Product benefit & adoption'!AX23*'Product benefit & adoption'!$P23/1000000,'Product benefit & adoption'!$G$4=\"2020-25\",'Product benefit & adoption'!AX23*'Product benefit & adoption'!$N23/1000000,'Product benefit & adoption'!$G$4=\"2015-20\",'Product benefit & adoption'!AX23*'Product benefit & adoption'!$L23/1000000)","v":0},{"$f":"_xlfn.IFS('Product benefit & adoption'!$G$4=\"ALL\",'Product benefit & adoption'!AY23*'Product benefit & adoption'!$P23/1000000,'Product benefit & adoption'!$G$4=\"2020-25\",'Product benefit & adoption'!AY23*'Product benefit & adoption'!$N23/1000000,'Product benefit & adoption'!$G$4=\"2015-20\",'Product benefit & adoption'!AY23*'Product benefit & adoption'!$L23/1000000)","v":0},{"$f":"_xlfn.IFS('Product benefit & adoption'!$G$4=\"ALL\",'Product benefit & adoption'!AZ23*'Product benefit & adoption'!$P23/1000000,'Product benefit & adoption'!$G$4=\"2020-25\",'Product benefit & adoption'!AZ23*'Product benefit & adoption'!$N23/1000000,'Product benefit & adoption'!$G$4=\"2015-20\",'Product benefit & adoption'!AZ23*'Product benefit & adoption'!$L23/1000000)","v":0},{"$f":"_xlfn.IFS('Product benefit & adoption'!$G$4=\"ALL\",'Product benefit & adoption'!BA23*'Product benefit & adoption'!$P23/1000000,'Product benefit & adoption'!$G$4=\"2020-25\",'Product benefit & adoption'!BA23*'Product benefit & adoption'!$N23/1000000,'Product benefit & adoption'!$G$4=\"2015-20\",'Product benefit & adoption'!BA23*'Product benefit & adoption'!$L23/1000000)","v":0},{"$f":"_xlfn.IFS('Product benefit & adoption'!$G$4=\"ALL\",'Product benefit & adoption'!BB23*'Product benefit & adoption'!$P23/1000000,'Product benefit & adoption'!$G$4=\"2020-25\",'Product benefit & adoption'!BB23*'Product benefit & adoption'!$N23/1000000,'Product benefit & adoption'!$G$4=\"2015-20\",'Product benefit & adoption'!BB23*'Product benefit & adoption'!$L23/1000000)","v":0},{"$f":"_xlfn.IFS('Product benefit & adoption'!$G$4=\"ALL\",'Product benefit & adoption'!BC23*'Product benefit & adoption'!$P23/1000000,'Product benefit & adoption'!$G$4=\"2020-25\",'Product benefit & adoption'!BC23*'Product benefit & adoption'!$N23/1000000,'Product benefit & adoption'!$G$4=\"2015-20\",'Product benefit & adoption'!BC23*'Product benefit & adoption'!$L23/1000000)","v":0},{"$f":"_xlfn.IFS('Product benefit & adoption'!$G$4=\"ALL\",'Product benefit & adoption'!BD23*'Product benefit & adoption'!$P23/1000000,'Product benefit & adoption'!$G$4=\"2020-25\",'Product benefit & adoption'!BD23*'Product benefit & adoption'!$N23/1000000,'Product benefit & adoption'!$G$4=\"2015-20\",'Product benefit & adoption'!BD23*'Product benefit & adoption'!$L23/1000000)","v":0}]
[null,14,{"$f":"IF('Product benefit & adoption'!D24=\"\",\"\",'Product benefit & adoption'!D24)","v":""},{"$f":"IF('Product benefit & adoption'!F24=\"\",\"\",'Product benefit & adoption'!F24)","v":""},0,{"$f":"_xlfn.IFS('Product benefit & adoption'!$G$4=\"ALL\",'Product benefit & adoption'!AA24*'Product benefit & adoption'!$P24/1000000,'Product benefit & adoption'!$G$4=\"2020-25\",'Product benefit & adoption'!AA24*'Product benefit & adoption'!$N24/1000000,'Product benefit & adoption'!$G$4=\"2015-20\",'Product benefit & adoption'!AA24*'Product benefit & adoption'!$L24/1000000)","v":0},{"$f":"_xlfn.IFS('Product benefit & adoption'!$G$4=\"ALL\",'Product benefit & adoption'!AB24*'Product benefit & adoption'!$P24/1000000,'Product benefit & adoption'!$G$4=\"2020-25\",'Product benefit & adoption'!AB24*'Product benefit & adoption'!$N24/1000000,'Product benefit & adoption'!$G$4=\"2015-20\",'Product benefit & adoption'!AB24*'Product benefit & adoption'!$L24/1000000)","v":0},{"$f":"_xlfn.IFS('Product benefit & adoption'!$G$4=\"ALL\",'Product benefit & adoption'!AC24*'Product benefit & adoption'!$P24/1000000,'Product benefit & adoption'!$G$4=\"2020-25\",'Product benefit & adoption'!AC24*'Product benefit & adoption'!$N24/1000000,'Product benefit & adoption'!$G$4=\"2015-20\",'Product benefit & adoption'!AC24*'Product benefit & adoption'!$L24/1000000)","v":0},{"$f":"_xlfn.IFS('Product benefit & adoption'!$G$4=\"ALL\",'Product benefit & adoption'!AD24*'Product benefit & adoption'!$P24/1000000,'Product benefit & adoption'!$G$4=\"2020-25\",'Product benefit & adoption'!AD24*'Product benefit & adoption'!$N24/1000000,'Product benefit & adoption'!$G$4=\"2015-20\",'Product benefit & adoption'!AD24*'Product benefit & adoption'!$L24/1000000)","v":0},{"$f":"_xlfn.IFS('Product benefit & adoption'!$G$4=\"ALL\",'Product benefit & adoption'!AE24*'Product benefit & adoption'!$P24/1000000,'Product benefit & adoption'!$G$4=\"2020-25\",'Product benefit & adoption'!AE24*'Product benefit & adoption'!$N24/1000000,'Product benefit & adoption'!$G$4=\"2015-20\",'Product benefit & adoption'!AE24*'Product benefit & adoption'!$L24/1000000)","v":0},{"$f":"_xlfn.IFS('Product benefit & adoption'!$G$4=\"ALL\",'Product benefit & adoption'!AF24*'Product benefit & adoption'!$P24/1000000,'Product benefit & adoption'!$G$4=\"2020-25\",'Product benefit & adoption'!AF24*'Product benefit & adoption'!$N24/1000000,'Product benefit & adoption'!$G$4=\"2015-20\",'Product benefit & adoption'!AF24*'Product benefit & adoption'!$L24/1000000)","v":0},{"$f":"_xlfn.IFS('Product benefit & adoption'!$G$4=\"ALL\",'Product benefit & adoption'!AG24*'Product benefit & adoption'!$P24/1000000,'Product benefit & adoption'!$G$4=\"2020-25\",'Product benefit & adoption'!AG24*'Product benefit & adoption'!$N24/1000000,'Product benefit & adoption'!$G$4=\"2015-20\",'Product benefit & adoption'!AG24*'Product benefit & adoption'!$L24/1000000)","v":0},{"$f":"_xlfn.IFS('Product benefit & adoption'!$G$4=\"ALL\",'Product benefit & adoption'!AH24*'Product benefit & adoption'!$P24/1000000,'Product benefit & adoption'!$G$4=\"2020-25\",'Product benefit & adoption'!AH24*'Product benefit & adoption'!$N24/1000000,'Product benefit & adoption'!$G$4=\"2015-20\",'Product benefit & adoption'!AH24*'Product benefit & adoption'!$L24/1000000)","v":0},{"$f":"_xlfn.IFS('Product benefit & adoption'!$G$4=\"ALL\",'Product benefit & adoption'!AI24*'Product benefit & adoption'!$P24/1000000,'Product benefit & adoption'!$G$4=\"2020-25\",'Product benefit & adoption'!AI24*'Product benefit & adoption'!$N24/1000000,'Product benefit & adoption'!$G$4=\"2015-20\",'Product benefit & adoption'!AI24*'Product benefit & adoption'!$L24/1000000)","v":0},{"$f":"_xlfn.IFS('Product benefit & adoption'!$G$4=\"ALL\",'Product benefit & adoption'!AJ24*'Product benefit & adoption'!$P24/1000000,'Product benefit & adoption'!$G$4=\"2020-25\",'Product benefit & adoption'!AJ24*'Product benefit & adoption'!$N24/1000000,'Product benefit & adoption'!$G$4=\"2015-20\",'Product benefit & adoption'!AJ24*'Product benefit & adoption'!$L24/1000000)","v":0},{"$f":"_xlfn.IFS('Product benefit & adoption'!$G$4=\"ALL\",'Product benefit & adoption'!AK24*'Product benefit & adoption'!$P24/1000000,'Product benefit & adoption'!$G$4=\"2020-25\",'Product benefit & adoption'!AK24*'Product benefit & adoption'!$N24/1000000,'Product benefit & adoption'!$G$4=\"2015-20\",'Product benefit & adoption'!AK24*'Product benefit & adoption'!$L24/1000000)","v":0},{"$f":"_xlfn.IFS('Product benefit & adoption'!$G$4=\"ALL\",'Product benefit & adoption'!AL24*'Product benefit & adoption'!$P24/1000000,'Product benefit & adoption'!$G$4=\"2020-25\",'Product benefit & adoption'!AL24*'Product benefit & adoption'!$N24/1000000,'Product benefit & adoption'!$G$4=\"2015-20\",'Product benefit & adoption'!AL24*'Product benefit & adoption'!$L24/1000000)","v":0},{"$f":"_xlfn.IFS('Product benefit & adoption'!$G$4=\"ALL\",'Product benefit & adoption'!AM24*'Product benefit & adoption'!$P24/1000000,'Product benefit & adoption'!$G$4=\"2020-25\",'Product benefit & adoption'!AM24*'Product benefit & adoption'!$N24/1000000,'Product benefit & adoption'!$G$4=\"2015-20\",'Product benefit & adoption'!AM24*'Product benefit & adoption'!$L24/1000000)","v":0},{"$f":"_xlfn.IFS('Product benefit & adoption'!$G$4=\"ALL\",'Product benefit & adoption'!AN24*'Product benefit & adoption'!$P24/1000000,'Product benefit & adoption'!$G$4=\"2020-25\",'Product benefit & adoption'!AN24*'Product benefit & adoption'!$N24/1000000,'Product benefit & adoption'!$G$4=\"2015-20\",'Product benefit & adoption'!AN24*'Product benefit & adoption'!$L24/1000000)","v":0},{"$f":"_xlfn.IFS('Product benefit & adoption'!$G$4=\"ALL\",'Product benefit & adoption'!AO24*'Product benefit & adoption'!$P24/1000000,'Product benefit & adoption'!$G$4=\"2020-25\",'Product benefit & adoption'!AO24*'Product benefit & adoption'!$N24/1000000,'Product benefit & adoption'!$G$4=\"2015-20\",'Product benefit & adoption'!AO24*'Product benefit & adoption'!$L24/1000000)","v":0},{"$f":"_xlfn.IFS('Product benefit & adoption'!$G$4=\"ALL\",'Product benefit & adoption'!AP24*'Product benefit & adoption'!$P24/1000000,'Product benefit & adoption'!$G$4=\"2020-25\",'Product benefit & adoption'!AP24*'Product benefit & adoption'!$N24/1000000,'Product benefit & adoption'!$G$4=\"2015-20\",'Product benefit & adoption'!AP24*'Product benefit & adoption'!$L24/1000000)","v":0},{"$f":"_xlfn.IFS('Product benefit & adoption'!$G$4=\"ALL\",'Product benefit & adoption'!AQ24*'Product benefit & adoption'!$P24/1000000,'Product benefit & adoption'!$G$4=\"2020-25\",'Product benefit & adoption'!AQ24*'Product benefit & adoption'!$N24/1000000,'Product benefit & adoption'!$G$4=\"2015-20\",'Product benefit & adoption'!AQ24*'Product benefit & adoption'!$L24/1000000)","v":0},{"$f":"_xlfn.IFS('Product benefit & adoption'!$G$4=\"ALL\",'Product benefit & adoption'!AR24*'Product benefit & adoption'!$P24/1000000,'Product benefit & adoption'!$G$4=\"2020-25\",'Product benefit & adoption'!AR24*'Product benefit & adoption'!$N24/1000000,'Product benefit & adoption'!$G$4=\"2015-20\",'Product benefit & adoption'!AR24*'Product benefit & adoption'!$L24/1000000)","v":0},{"$f":"_xlfn.IFS('Product benefit & adoption'!$G$4=\"ALL\",'Product benefit & adoption'!AS24*'Product benefit & adoption'!$P24/1000000,'Product benefit & adoption'!$G$4=\"2020-25\",'Product benefit & adoption'!AS24*'Product benefit & adoption'!$N24/1000000,'Product benefit & adoption'!$G$4=\"2015-20\",'Product benefit & adoption'!AS24*'Product benefit & adoption'!$L24/1000000)","v":0},{"$f":"_xlfn.IFS('Product benefit & adoption'!$G$4=\"ALL\",'Product benefit & adoption'!AT24*'Product benefit & adoption'!$P24/1000000,'Product benefit & adoption'!$G$4=\"2020-25\",'Product benefit & adoption'!AT24*'Product benefit & adoption'!$N24/1000000,'Product benefit & adoption'!$G$4=\"2015-20\",'Product benefit & adoption'!AT24*'Product benefit & adoption'!$L24/1000000)","v":0},{"$f":"_xlfn.IFS('Product benefit & adoption'!$G$4=\"ALL\",'Product benefit & adoption'!AU24*'Product benefit & adoption'!$P24/1000000,'Product benefit & adoption'!$G$4=\"2020-25\",'Product benefit & adoption'!AU24*'Product benefit & adoption'!$N24/1000000,'Product benefit & adoption'!$G$4=\"2015-20\",'Product benefit & adoption'!AU24*'Product benefit & adoption'!$L24/1000000)","v":0},{"$f":"_xlfn.IFS('Product benefit & adoption'!$G$4=\"ALL\",'Product benefit & adoption'!AV24*'Product benefit & adoption'!$P24/1000000,'Product benefit & adoption'!$G$4=\"2020-25\",'Product benefit & adoption'!AV24*'Product benefit & adoption'!$N24/1000000,'Product benefit & adoption'!$G$4=\"2015-20\",'Product benefit & adoption'!AV24*'Product benefit & adoption'!$L24/1000000)","v":0},{"$f":"_xlfn.IFS('Product benefit & adoption'!$G$4=\"ALL\",'Product benefit & adoption'!AW24*'Product benefit & adoption'!$P24/1000000,'Product benefit & adoption'!$G$4=\"2020-25\",'Product benefit & adoption'!AW24*'Product benefit & adoption'!$N24/1000000,'Product benefit & adoption'!$G$4=\"2015-20\",'Product benefit & adoption'!AW24*'Product benefit & adoption'!$L24/1000000)","v":0},{"$f":"_xlfn.IFS('Product benefit & adoption'!$G$4=\"ALL\",'Product benefit & adoption'!AX24*'Product benefit & adoption'!$P24/1000000,'Product benefit & adoption'!$G$4=\"2020-25\",'Product benefit & adoption'!AX24*'Product benefit & adoption'!$N24/1000000,'Product benefit & adoption'!$G$4=\"2015-20\",'Product benefit & adoption'!AX24*'Product benefit & adoption'!$L24/1000000)","v":0},{"$f":"_xlfn.IFS('Product benefit & adoption'!$G$4=\"ALL\",'Product benefit & adoption'!AY24*'Product benefit & adoption'!$P24/1000000,'Product benefit & adoption'!$G$4=\"2020-25\",'Product benefit & adoption'!AY24*'Product benefit & adoption'!$N24/1000000,'Product benefit & adoption'!$G$4=\"2015-20\",'Product benefit & adoption'!AY24*'Product benefit & adoption'!$L24/1000000)","v":0},{"$f":"_xlfn.IFS('Product benefit & adoption'!$G$4=\"ALL\",'Product benefit & adoption'!AZ24*'Product benefit & adoption'!$P24/1000000,'Product benefit & adoption'!$G$4=\"2020-25\",'Product benefit & adoption'!AZ24*'Product benefit & adoption'!$N24/1000000,'Product benefit & adoption'!$G$4=\"2015-20\",'Product benefit & adoption'!AZ24*'Product benefit & adoption'!$L24/1000000)","v":0},{"$f":"_xlfn.IFS('Product benefit & adoption'!$G$4=\"ALL\",'Product benefit & adoption'!BA24*'Product benefit & adoption'!$P24/1000000,'Product benefit & adoption'!$G$4=\"2020-25\",'Product benefit & adoption'!BA24*'Product benefit & adoption'!$N24/1000000,'Product benefit & adoption'!$G$4=\"2015-20\",'Product benefit & adoption'!BA24*'Product benefit & adoption'!$L24/1000000)","v":0},{"$f":"_xlfn.IFS('Product benefit & adoption'!$G$4=\"ALL\",'Product benefit & adoption'!BB24*'Product benefit & adoption'!$P24/1000000,'Product benefit & adoption'!$G$4=\"2020-25\",'Product benefit & adoption'!BB24*'Product benefit & adoption'!$N24/1000000,'Product benefit & adoption'!$G$4=\"2015-20\",'Product benefit & adoption'!BB24*'Product benefit & adoption'!$L24/1000000)","v":0},{"$f":"_xlfn.IFS('Product benefit & adoption'!$G$4=\"ALL\",'Product benefit & adoption'!BC24*'Product benefit & adoption'!$P24/1000000,'Product benefit & adoption'!$G$4=\"2020-25\",'Product benefit & adoption'!BC24*'Product benefit & adoption'!$N24/1000000,'Product benefit & adoption'!$G$4=\"2015-20\",'Product benefit & adoption'!BC24*'Product benefit & adoption'!$L24/1000000)","v":0},{"$f":"_xlfn.IFS('Product benefit & adoption'!$G$4=\"ALL\",'Product benefit & adoption'!BD24*'Product benefit & adoption'!$P24/1000000,'Product benefit & adoption'!$G$4=\"2020-25\",'Product benefit & adoption'!BD24*'Product benefit & adoption'!$N24/1000000,'Product benefit & adoption'!$G$4=\"2015-20\",'Product benefit & adoption'!BD24*'Product benefit & adoption'!$L24/1000000)","v":0}]
[null,15,{"$f":"IF('Product benefit & adoption'!D25=\"\",\"\",'Product benefit & adoption'!D25)","v":""},{"$f":"IF('Product benefit & adoption'!F25=\"\",\"\",'Product benefit & adoption'!F25)","v":""},0,{"$f":"_xlfn.IFS('Product benefit & adoption'!$G$4=\"ALL\",'Product benefit & adoption'!AA25*'Product benefit & adoption'!$P25/1000000,'Product benefit & adoption'!$G$4=\"2020-25\",'Product benefit & adoption'!AA25*'Product benefit & adoption'!$N25/1000000,'Product benefit & adoption'!$G$4=\"2015-20\",'Product benefit & adoption'!AA25*'Product benefit & adoption'!$L25/1000000)","v":0},{"$f":"_xlfn.IFS('Product benefit & adoption'!$G$4=\"ALL\",'Product benefit & adoption'!AB25*'Product benefit & adoption'!$P25/1000000,'Product benefit & adoption'!$G$4=\"2020-25\",'Product benefit & adoption'!AB25*'Product benefit & adoption'!$N25/1000000,'Product benefit & adoption'!$G$4=\"2015-20\",'Product benefit & adoption'!AB25*'Product benefit & adoption'!$L25/1000000)","v":0},{"$f":"_xlfn.IFS('Product benefit & adoption'!$G$4=\"ALL\",'Product benefit & adoption'!AC25*'Product benefit & adoption'!$P25/1000000,'Product benefit & adoption'!$G$4=\"2020-25\",'Product benefit & adoption'!AC25*'Product benefit & adoption'!$N25/1000000,'Product benefit & adoption'!$G$4=\"2015-20\",'Product benefit & adoption'!AC25*'Product benefit & adoption'!$L25/1000000)","v":0},{"$f":"_xlfn.IFS('Product benefit & adoption'!$G$4=\"ALL\",'Product benefit & adoption'!AD25*'Product benefit & adoption'!$P25/1000000,'Product benefit & adoption'!$G$4=\"2020-25\",'Product benefit & adoption'!AD25*'Product benefit & adoption'!$N25/1000000,'Product benefit & adoption'!$G$4=\"2015-20\",'Product benefit & adoption'!AD25*'Product benefit & adoption'!$L25/1000000)","v":0},{"$f":"_xlfn.IFS('Product benefit & adoption'!$G$4=\"ALL\",'Product benefit & adoption'!AE25*'Product benefit & adoption'!$P25/1000000,'Product benefit & adoption'!$G$4=\"2020-25\",'Product benefit & adoption'!AE25*'Product benefit & adoption'!$N25/1000000,'Product benefit & adoption'!$G$4=\"2015-20\",'Product benefit & adoption'!AE25*'Product benefit & adoption'!$L25/1000000)","v":0},{"$f":"_xlfn.IFS('Product benefit & adoption'!$G$4=\"ALL\",'Product benefit & adoption'!AF25*'Product benefit & adoption'!$P25/1000000,'Product benefit & adoption'!$G$4=\"2020-25\",'Product benefit & adoption'!AF25*'Product benefit & adoption'!$N25/1000000,'Product benefit & adoption'!$G$4=\"2015-20\",'Product benefit & adoption'!AF25*'Product benefit & adoption'!$L25/1000000)","v":0},{"$f":"_xlfn.IFS('Product benefit & adoption'!$G$4=\"ALL\",'Product benefit & adoption'!AG25*'Product benefit & adoption'!$P25/1000000,'Product benefit & adoption'!$G$4=\"2020-25\",'Product benefit & adoption'!AG25*'Product benefit & adoption'!$N25/1000000,'Product benefit & adoption'!$G$4=\"2015-20\",'Product benefit & adoption'!AG25*'Product benefit & adoption'!$L25/1000000)","v":0},{"$f":"_xlfn.IFS('Product benefit & adoption'!$G$4=\"ALL\",'Product benefit & adoption'!AH25*'Product benefit & adoption'!$P25/1000000,'Product benefit & adoption'!$G$4=\"2020-25\",'Product benefit & adoption'!AH25*'Product benefit & adoption'!$N25/1000000,'Product benefit & adoption'!$G$4=\"2015-20\",'Product benefit & adoption'!AH25*'Product benefit & adoption'!$L25/1000000)","v":0},{"$f":"_xlfn.IFS('Product benefit & adoption'!$G$4=\"ALL\",'Product benefit & adoption'!AI25*'Product benefit & adoption'!$P25/1000000,'Product benefit & adoption'!$G$4=\"2020-25\",'Product benefit & adoption'!AI25*'Product benefit & adoption'!$N25/1000000,'Product benefit & adoption'!$G$4=\"2015-20\",'Product benefit & adoption'!AI25*'Product benefit & adoption'!$L25/1000000)","v":0},{"$f":"_xlfn.IFS('Product benefit & adoption'!$G$4=\"ALL\",'Product benefit & adoption'!AJ25*'Product benefit & adoption'!$P25/1000000,'Product benefit & adoption'!$G$4=\"2020-25\",'Product benefit & adoption'!AJ25*'Product benefit & adoption'!$N25/1000000,'Product benefit & adoption'!$G$4=\"2015-20\",'Product benefit & adoption'!AJ25*'Product benefit & adoption'!$L25/1000000)","v":0},{"$f":"_xlfn.IFS('Product benefit & adoption'!$G$4=\"ALL\",'Product benefit & adoption'!AK25*'Product benefit & adoption'!$P25/1000000,'Product benefit & adoption'!$G$4=\"2020-25\",'Product benefit & adoption'!AK25*'Product benefit & adoption'!$N25/1000000,'Product benefit & adoption'!$G$4=\"2015-20\",'Product benefit & adoption'!AK25*'Product benefit & adoption'!$L25/1000000)","v":0},{"$f":"_xlfn.IFS('Product benefit & adoption'!$G$4=\"ALL\",'Product benefit & adoption'!AL25*'Product benefit & adoption'!$P25/1000000,'Product benefit & adoption'!$G$4=\"2020-25\",'Product benefit & adoption'!AL25*'Product benefit & adoption'!$N25/1000000,'Product benefit & adoption'!$G$4=\"2015-20\",'Product benefit & adoption'!AL25*'Product benefit & adoption'!$L25/1000000)","v":0},{"$f":"_xlfn.IFS('Product benefit & adoption'!$G$4=\"ALL\",'Product benefit & adoption'!AM25*'Product benefit & adoption'!$P25/1000000,'Product benefit & adoption'!$G$4=\"2020-25\",'Product benefit & adoption'!AM25*'Product benefit & adoption'!$N25/1000000,'Product benefit & adoption'!$G$4=\"2015-20\",'Product benefit & adoption'!AM25*'Product benefit & adoption'!$L25/1000000)","v":0},{"$f":"_xlfn.IFS('Product benefit & adoption'!$G$4=\"ALL\",'Product benefit & adoption'!AN25*'Product benefit & adoption'!$P25/1000000,'Product benefit & adoption'!$G$4=\"2020-25\",'Product benefit & adoption'!AN25*'Product benefit & adoption'!$N25/1000000,'Product benefit & adoption'!$G$4=\"2015-20\",'Product benefit & adoption'!AN25*'Product benefit & adoption'!$L25/1000000)","v":0},{"$f":"_xlfn.IFS('Product benefit & adoption'!$G$4=\"ALL\",'Product benefit & adoption'!AO25*'Product benefit & adoption'!$P25/1000000,'Product benefit & adoption'!$G$4=\"2020-25\",'Product benefit & adoption'!AO25*'Product benefit & adoption'!$N25/1000000,'Product benefit & adoption'!$G$4=\"2015-20\",'Product benefit & adoption'!AO25*'Product benefit & adoption'!$L25/1000000)","v":0},{"$f":"_xlfn.IFS('Product benefit & adoption'!$G$4=\"ALL\",'Product benefit & adoption'!AP25*'Product benefit & adoption'!$P25/1000000,'Product benefit & adoption'!$G$4=\"2020-25\",'Product benefit & adoption'!AP25*'Product benefit & adoption'!$N25/1000000,'Product benefit & adoption'!$G$4=\"2015-20\",'Product benefit & adoption'!AP25*'Product benefit & adoption'!$L25/1000000)","v":0},{"$f":"_xlfn.IFS('Product benefit & adoption'!$G$4=\"ALL\",'Product benefit & adoption'!AQ25*'Product benefit & adoption'!$P25/1000000,'Product benefit & adoption'!$G$4=\"2020-25\",'Product benefit & adoption'!AQ25*'Product benefit & adoption'!$N25/1000000,'Product benefit & adoption'!$G$4=\"2015-20\",'Product benefit & adoption'!AQ25*'Product benefit & adoption'!$L25/1000000)","v":0},{"$f":"_xlfn.IFS('Product benefit & adoption'!$G$4=\"ALL\",'Product benefit & adoption'!AR25*'Product benefit & adoption'!$P25/1000000,'Product benefit & adoption'!$G$4=\"2020-25\",'Product benefit & adoption'!AR25*'Product benefit & adoption'!$N25/1000000,'Product benefit & adoption'!$G$4=\"2015-20\",'Product benefit & adoption'!AR25*'Product benefit & adoption'!$L25/1000000)","v":0},{"$f":"_xlfn.IFS('Product benefit & adoption'!$G$4=\"ALL\",'Product benefit & adoption'!AS25*'Product benefit & adoption'!$P25/1000000,'Product benefit & adoption'!$G$4=\"2020-25\",'Product benefit & adoption'!AS25*'Product benefit & adoption'!$N25/1000000,'Product benefit & adoption'!$G$4=\"2015-20\",'Product benefit & adoption'!AS25*'Product benefit & adoption'!$L25/1000000)","v":0},{"$f":"_xlfn.IFS('Product benefit & adoption'!$G$4=\"ALL\",'Product benefit & adoption'!AT25*'Product benefit & adoption'!$P25/1000000,'Product benefit & adoption'!$G$4=\"2020-25\",'Product benefit & adoption'!AT25*'Product benefit & adoption'!$N25/1000000,'Product benefit & adoption'!$G$4=\"2015-20\",'Product benefit & adoption'!AT25*'Product benefit & adoption'!$L25/1000000)","v":0},{"$f":"_xlfn.IFS('Product benefit & adoption'!$G$4=\"ALL\",'Product benefit & adoption'!AU25*'Product benefit & adoption'!$P25/1000000,'Product benefit & adoption'!$G$4=\"2020-25\",'Product benefit & adoption'!AU25*'Product benefit & adoption'!$N25/1000000,'Product benefit & adoption'!$G$4=\"2015-20\",'Product benefit & adoption'!AU25*'Product benefit & adoption'!$L25/1000000)","v":0},{"$f":"_xlfn.IFS('Product benefit & adoption'!$G$4=\"ALL\",'Product benefit & adoption'!AV25*'Product benefit & adoption'!$P25/1000000,'Product benefit & adoption'!$G$4=\"2020-25\",'Product benefit & adoption'!AV25*'Product benefit & adoption'!$N25/1000000,'Product benefit & adoption'!$G$4=\"2015-20\",'Product benefit & adoption'!AV25*'Product benefit & adoption'!$L25/1000000)","v":0},{"$f":"_xlfn.IFS('Product benefit & adoption'!$G$4=\"ALL\",'Product benefit & adoption'!AW25*'Product benefit & adoption'!$P25/1000000,'Product benefit & adoption'!$G$4=\"2020-25\",'Product benefit & adoption'!AW25*'Product benefit & adoption'!$N25/1000000,'Product benefit & adoption'!$G$4=\"2015-20\",'Product benefit & adoption'!AW25*'Product benefit & adoption'!$L25/1000000)","v":0},{"$f":"_xlfn.IFS('Product benefit & adoption'!$G$4=\"ALL\",'Product benefit & adoption'!AX25*'Product benefit & adoption'!$P25/1000000,'Product benefit & adoption'!$G$4=\"2020-25\",'Product benefit & adoption'!AX25*'Product benefit & adoption'!$N25/1000000,'Product benefit & adoption'!$G$4=\"2015-20\",'Product benefit & adoption'!AX25*'Product benefit & adoption'!$L25/1000000)","v":0},{"$f":"_xlfn.IFS('Product benefit & adoption'!$G$4=\"ALL\",'Product benefit & adoption'!AY25*'Product benefit & adoption'!$P25/1000000,'Product benefit & adoption'!$G$4=\"2020-25\",'Product benefit & adoption'!AY25*'Product benefit & adoption'!$N25/1000000,'Product benefit & adoption'!$G$4=\"2015-20\",'Product benefit & adoption'!AY25*'Product benefit & adoption'!$L25/1000000)","v":0},{"$f":"_xlfn.IFS('Product benefit & adoption'!$G$4=\"ALL\",'Product benefit & adoption'!AZ25*'Product benefit & adoption'!$P25/1000000,'Product benefit & adoption'!$G$4=\"2020-25\",'Product benefit & adoption'!AZ25*'Product benefit & adoption'!$N25/1000000,'Product benefit & adoption'!$G$4=\"2015-20\",'Product benefit & adoption'!AZ25*'Product benefit & adoption'!$L25/1000000)","v":0},{"$f":"_xlfn.IFS('Product benefit & adoption'!$G$4=\"ALL\",'Product benefit & adoption'!BA25*'Product benefit & adoption'!$P25/1000000,'Product benefit & adoption'!$G$4=\"2020-25\",'Product benefit & adoption'!BA25*'Product benefit & adoption'!$N25/1000000,'Product benefit & adoption'!$G$4=\"2015-20\",'Product benefit & adoption'!BA25*'Product benefit & adoption'!$L25/1000000)","v":0},{"$f":"_xlfn.IFS('Product benefit & adoption'!$G$4=\"ALL\",'Product benefit & adoption'!BB25*'Product benefit & adoption'!$P25/1000000,'Product benefit & adoption'!$G$4=\"2020-25\",'Product benefit & adoption'!BB25*'Product benefit & adoption'!$N25/1000000,'Product benefit & adoption'!$G$4=\"2015-20\",'Product benefit & adoption'!BB25*'Product benefit & adoption'!$L25/1000000)","v":0},{"$f":"_xlfn.IFS('Product benefit & adoption'!$G$4=\"ALL\",'Product benefit & adoption'!BC25*'Product benefit & adoption'!$P25/1000000,'Product benefit & adoption'!$G$4=\"2020-25\",'Product benefit & adoption'!BC25*'Product benefit & adoption'!$N25/1000000,'Product benefit & adoption'!$G$4=\"2015-20\",'Product benefit & adoption'!BC25*'Product benefit & adoption'!$L25/1000000)","v":0},{"$f":"_xlfn.IFS('Product benefit & adoption'!$G$4=\"ALL\",'Product benefit & adoption'!BD25*'Product benefit & adoption'!$P25/1000000,'Product benefit & adoption'!$G$4=\"2020-25\",'Product benefit & adoption'!BD25*'Product benefit & adoption'!$N25/1000000,'Product benefit & adoption'!$G$4=\"2015-20\",'Product benefit & adoption'!BD25*'Product benefit & adoption'!$L25/1000000)","v":0}]
[null,16,{"$f":"IF('Product benefit & adoption'!D26=\"\",\"\",'Product benefit & adoption'!D26)","v":""},{"$f":"IF('Product benefit & adoption'!F26=\"\",\"\",'Product benefit & adoption'!F26)","v":""},0,{"$f":"_xlfn.IFS('Product benefit & adoption'!$G$4=\"ALL\",'Product benefit & adoption'!AA26*'Product benefit & adoption'!$P26/1000000,'Product benefit & adoption'!$G$4=\"2020-25\",'Product benefit & adoption'!AA26*'Product benefit & adoption'!$N26/1000000,'Product benefit & adoption'!$G$4=\"2015-20\",'Product benefit & adoption'!AA26*'Product benefit & adoption'!$L26/1000000)","v":0},{"$f":"_xlfn.IFS('Product benefit & adoption'!$G$4=\"ALL\",'Product benefit & adoption'!AB26*'Product benefit & adoption'!$P26/1000000,'Product benefit & adoption'!$G$4=\"2020-25\",'Product benefit & adoption'!AB26*'Product benefit & adoption'!$N26/1000000,'Product benefit & adoption'!$G$4=\"2015-20\",'Product benefit & adoption'!AB26*'Product benefit & adoption'!$L26/1000000)","v":0},{"$f":"_xlfn.IFS('Product benefit & adoption'!$G$4=\"ALL\",'Product benefit & adoption'!AC26*'Product benefit & adoption'!$P26/1000000,'Product benefit & adoption'!$G$4=\"2020-25\",'Product benefit & adoption'!AC26*'Product benefit & adoption'!$N26/1000000,'Product benefit & adoption'!$G$4=\"2015-20\",'Product benefit & adoption'!AC26*'Product benefit & adoption'!$L26/1000000)","v":0},{"$f":"_xlfn.IFS('Product benefit & adoption'!$G$4=\"ALL\",'Product benefit & adoption'!AD26*'Product benefit & adoption'!$P26/1000000,'Product benefit & adoption'!$G$4=\"2020-25\",'Product benefit & adoption'!AD26*'Product benefit & adoption'!$N26/1000000,'Product benefit & adoption'!$G$4=\"2015-20\",'Product benefit & adoption'!AD26*'Product benefit & adoption'!$L26/1000000)","v":0},{"$f":"_xlfn.IFS('Product benefit & adoption'!$G$4=\"ALL\",'Product benefit & adoption'!AE26*'Product benefit & adoption'!$P26/1000000,'Product benefit & adoption'!$G$4=\"2020-25\",'Product benefit & adoption'!AE26*'Product benefit & adoption'!$N26/1000000,'Product benefit & adoption'!$G$4=\"2015-20\",'Product benefit & adoption'!AE26*'Product benefit & adoption'!$L26/1000000)","v":0},{"$f":"_xlfn.IFS('Product benefit & adoption'!$G$4=\"ALL\",'Product benefit & adoption'!AF26*'Product benefit & adoption'!$P26/1000000,'Product benefit & adoption'!$G$4=\"2020-25\",'Product benefit & adoption'!AF26*'Product benefit & adoption'!$N26/1000000,'Product benefit & adoption'!$G$4=\"2015-20\",'Product benefit & adoption'!AF26*'Product benefit & adoption'!$L26/1000000)","v":0},{"$f":"_xlfn.IFS('Product benefit & adoption'!$G$4=\"ALL\",'Product benefit & adoption'!AG26*'Product benefit & adoption'!$P26/1000000,'Product benefit & adoption'!$G$4=\"2020-25\",'Product benefit & adoption'!AG26*'Product benefit & adoption'!$N26/1000000,'Product benefit & adoption'!$G$4=\"2015-20\",'Product benefit & adoption'!AG26*'Product benefit & adoption'!$L26/1000000)","v":0},{"$f":"_xlfn.IFS('Product benefit & adoption'!$G$4=\"ALL\",'Product benefit & adoption'!AH26*'Product benefit & adoption'!$P26/1000000,'Product benefit & adoption'!$G$4=\"2020-25\",'Product benefit & adoption'!AH26*'Product benefit & adoption'!$N26/1000000,'Product benefit & adoption'!$G$4=\"2015-20\",'Product benefit & adoption'!AH26*'Product benefit & adoption'!$L26/1000000)","v":0},{"$f":"_xlfn.IFS('Product benefit & adoption'!$G$4=\"ALL\",'Product benefit & adoption'!AI26*'Product benefit & adoption'!$P26/1000000,'Product benefit & adoption'!$G$4=\"2020-25\",'Product benefit & adoption'!AI26*'Product benefit & adoption'!$N26/1000000,'Product benefit & adoption'!$G$4=\"2015-20\",'Product benefit & adoption'!AI26*'Product benefit & adoption'!$L26/1000000)","v":0},{"$f":"_xlfn.IFS('Product benefit & adoption'!$G$4=\"ALL\",'Product benefit & adoption'!AJ26*'Product benefit & adoption'!$P26/1000000,'Product benefit & adoption'!$G$4=\"2020-25\",'Product benefit & adoption'!AJ26*'Product benefit & adoption'!$N26/1000000,'Product benefit & adoption'!$G$4=\"2015-20\",'Product benefit & adoption'!AJ26*'Product benefit & adoption'!$L26/1000000)","v":0},{"$f":"_xlfn.IFS('Product benefit & adoption'!$G$4=\"ALL\",'Product benefit & adoption'!AK26*'Product benefit & adoption'!$P26/1000000,'Product benefit & adoption'!$G$4=\"2020-25\",'Product benefit & adoption'!AK26*'Product benefit & adoption'!$N26/1000000,'Product benefit & adoption'!$G$4=\"2015-20\",'Product benefit & adoption'!AK26*'Product benefit & adoption'!$L26/1000000)","v":0},{"$f":"_xlfn.IFS('Product benefit & adoption'!$G$4=\"ALL\",'Product benefit & adoption'!AL26*'Product benefit & adoption'!$P26/1000000,'Product benefit & adoption'!$G$4=\"2020-25\",'Product benefit & adoption'!AL26*'Product benefit & adoption'!$N26/1000000,'Product benefit & adoption'!$G$4=\"2015-20\",'Product benefit & adoption'!AL26*'Product benefit & adoption'!$L26/1000000)","v":0},{"$f":"_xlfn.IFS('Product benefit & adoption'!$G$4=\"ALL\",'Product benefit & adoption'!AM26*'Product benefit & adoption'!$P26/1000000,'Product benefit & adoption'!$G$4=\"2020-25\",'Product benefit & adoption'!AM26*'Product benefit & adoption'!$N26/1000000,'Product benefit & adoption'!$G$4=\"2015-20\",'Product benefit & adoption'!AM26*'Product benefit & adoption'!$L26/1000000)","v":0},{"$f":"_xlfn.IFS('Product benefit & adoption'!$G$4=\"ALL\",'Product benefit & adoption'!AN26*'Product benefit & adoption'!$P26/1000000,'Product benefit & adoption'!$G$4=\"2020-25\",'Product benefit & adoption'!AN26*'Product benefit & adoption'!$N26/1000000,'Product benefit & adoption'!$G$4=\"2015-20\",'Product benefit & adoption'!AN26*'Product benefit & adoption'!$L26/1000000)","v":0},{"$f":"_xlfn.IFS('Product benefit & adoption'!$G$4=\"ALL\",'Product benefit & adoption'!AO26*'Product benefit & adoption'!$P26/1000000,'Product benefit & adoption'!$G$4=\"2020-25\",'Product benefit & adoption'!AO26*'Product benefit & adoption'!$N26/1000000,'Product benefit & adoption'!$G$4=\"2015-20\",'Product benefit & adoption'!AO26*'Product benefit & adoption'!$L26/1000000)","v":0},{"$f":"_xlfn.IFS('Product benefit & adoption'!$G$4=\"ALL\",'Product benefit & adoption'!AP26*'Product benefit & adoption'!$P26/1000000,'Product benefit & adoption'!$G$4=\"2020-25\",'Product benefit & adoption'!AP26*'Product benefit & adoption'!$N26/1000000,'Product benefit & adoption'!$G$4=\"2015-20\",'Product benefit & adoption'!AP26*'Product benefit & adoption'!$L26/1000000)","v":0},{"$f":"_xlfn.IFS('Product benefit & adoption'!$G$4=\"ALL\",'Product benefit & adoption'!AQ26*'Product benefit & adoption'!$P26/1000000,'Product benefit & adoption'!$G$4=\"2020-25\",'Product benefit & adoption'!AQ26*'Product benefit & adoption'!$N26/1000000,'Product benefit & adoption'!$G$4=\"2015-20\",'Product benefit & adoption'!AQ26*'Product benefit & adoption'!$L26/1000000)","v":0},{"$f":"_xlfn.IFS('Product benefit & adoption'!$G$4=\"ALL\",'Product benefit & adoption'!AR26*'Product benefit & adoption'!$P26/1000000,'Product benefit & adoption'!$G$4=\"2020-25\",'Product benefit & adoption'!AR26*'Product benefit & adoption'!$N26/1000000,'Product benefit & adoption'!$G$4=\"2015-20\",'Product benefit & adoption'!AR26*'Product benefit & adoption'!$L26/1000000)","v":0},{"$f":"_xlfn.IFS('Product benefit & adoption'!$G$4=\"ALL\",'Product benefit & adoption'!AS26*'Product benefit & adoption'!$P26/1000000,'Product benefit & adoption'!$G$4=\"2020-25\",'Product benefit & adoption'!AS26*'Product benefit & adoption'!$N26/1000000,'Product benefit & adoption'!$G$4=\"2015-20\",'Product benefit & adoption'!AS26*'Product benefit & adoption'!$L26/1000000)","v":0},{"$f":"_xlfn.IFS('Product benefit & adoption'!$G$4=\"ALL\",'Product benefit & adoption'!AT26*'Product benefit & adoption'!$P26/1000000,'Product benefit & adoption'!$G$4=\"2020-25\",'Product benefit & adoption'!AT26*'Product benefit & adoption'!$N26/1000000,'Product benefit & adoption'!$G$4=\"2015-20\",'Product benefit & adoption'!AT26*'Product benefit & adoption'!$L26/1000000)","v":0},{"$f":"_xlfn.IFS('Product benefit & adoption'!$G$4=\"ALL\",'Product benefit & adoption'!AU26*'Product benefit & adoption'!$P26/1000000,'Product benefit & adoption'!$G$4=\"2020-25\",'Product benefit & adoption'!AU26*'Product benefit & adoption'!$N26/1000000,'Product benefit & adoption'!$G$4=\"2015-20\",'Product benefit & adoption'!AU26*'Product benefit & adoption'!$L26/1000000)","v":0},{"$f":"_xlfn.IFS('Product benefit & adoption'!$G$4=\"ALL\",'Product benefit & adoption'!AV26*'Product benefit & adoption'!$P26/1000000,'Product benefit & adoption'!$G$4=\"2020-25\",'Product benefit & adoption'!AV26*'Product benefit & adoption'!$N26/1000000,'Product benefit & adoption'!$G$4=\"2015-20\",'Product benefit & adoption'!AV26*'Product benefit & adoption'!$L26/1000000)","v":0},{"$f":"_xlfn.IFS('Product benefit & adoption'!$G$4=\"ALL\",'Product benefit & adoption'!AW26*'Product benefit & adoption'!$P26/1000000,'Product benefit & adoption'!$G$4=\"2020-25\",'Product benefit & adoption'!AW26*'Product benefit & adoption'!$N26/1000000,'Product benefit & adoption'!$G$4=\"2015-20\",'Product benefit & adoption'!AW26*'Product benefit & adoption'!$L26/1000000)","v":0},{"$f":"_xlfn.IFS('Product benefit & adoption'!$G$4=\"ALL\",'Product benefit & adoption'!AX26*'Product benefit & adoption'!$P26/1000000,'Product benefit & adoption'!$G$4=\"2020-25\",'Product benefit & adoption'!AX26*'Product benefit & adoption'!$N26/1000000,'Product benefit & adoption'!$G$4=\"2015-20\",'Product benefit & adoption'!AX26*'Product benefit & adoption'!$L26/1000000)","v":0},{"$f":"_xlfn.IFS('Product benefit & adoption'!$G$4=\"ALL\",'Product benefit & adoption'!AY26*'Product benefit & adoption'!$P26/1000000,'Product benefit & adoption'!$G$4=\"2020-25\",'Product benefit & adoption'!AY26*'Product benefit & adoption'!$N26/1000000,'Product benefit & adoption'!$G$4=\"2015-20\",'Product benefit & adoption'!AY26*'Product benefit & adoption'!$L26/1000000)","v":0},{"$f":"_xlfn.IFS('Product benefit & adoption'!$G$4=\"ALL\",'Product benefit & adoption'!AZ26*'Product benefit & adoption'!$P26/1000000,'Product benefit & adoption'!$G$4=\"2020-25\",'Product benefit & adoption'!AZ26*'Product benefit & adoption'!$N26/1000000,'Product benefit & adoption'!$G$4=\"2015-20\",'Product benefit & adoption'!AZ26*'Product benefit & adoption'!$L26/1000000)","v":0},{"$f":"_xlfn.IFS('Product benefit & adoption'!$G$4=\"ALL\",'Product benefit & adoption'!BA26*'Product benefit & adoption'!$P26/1000000,'Product benefit & adoption'!$G$4=\"2020-25\",'Product benefit & adoption'!BA26*'Product benefit & adoption'!$N26/1000000,'Product benefit & adoption'!$G$4=\"2015-20\",'Product benefit & adoption'!BA26*'Product benefit & adoption'!$L26/1000000)","v":0},{"$f":"_xlfn.IFS('Product benefit & adoption'!$G$4=\"ALL\",'Product benefit & adoption'!BB26*'Product benefit & adoption'!$P26/1000000,'Product benefit & adoption'!$G$4=\"2020-25\",'Product benefit & adoption'!BB26*'Product benefit & adoption'!$N26/1000000,'Product benefit & adoption'!$G$4=\"2015-20\",'Product benefit & adoption'!BB26*'Product benefit & adoption'!$L26/1000000)","v":0},{"$f":"_xlfn.IFS('Product benefit & adoption'!$G$4=\"ALL\",'Product benefit & adoption'!BC26*'Product benefit & adoption'!$P26/1000000,'Product benefit & adoption'!$G$4=\"2020-25\",'Product benefit & adoption'!BC26*'Product benefit & adoption'!$N26/1000000,'Product benefit & adoption'!$G$4=\"2015-20\",'Product benefit & adoption'!BC26*'Product benefit & adoption'!$L26/1000000)","v":0},{"$f":"_xlfn.IFS('Product benefit & adoption'!$G$4=\"ALL\",'Product benefit & adoption'!BD26*'Product benefit & adoption'!$P26/1000000,'Product benefit & adoption'!$G$4=\"2020-25\",'Product benefit & adoption'!BD26*'Product benefit & adoption'!$N26/1000000,'Product benefit & adoption'!$G$4=\"2015-20\",'Product benefit & adoption'!BD26*'Product benefit & adoption'!$L26/1000000)","v":0}]
[null,17,{"$f":"IF('Product benefit & adoption'!D27=\"\",\"\",'Product benefit & adoption'!D27)","v":""},{"$f":"IF('Product benefit & adoption'!F27=\"\",\"\",'Product benefit & adoption'!F27)","v":""},0,{"$f":"_xlfn.IFS('Product benefit & adoption'!$G$4=\"ALL\",'Product benefit & adoption'!AA27*'Product benefit & adoption'!$P27/1000000,'Product benefit & adoption'!$G$4=\"2020-25\",'Product benefit & adoption'!AA27*'Product benefit & adoption'!$N27/1000000,'Product benefit & adoption'!$G$4=\"2015-20\",'Product benefit & adoption'!AA27*'Product benefit & adoption'!$L27/1000000)","v":0},{"$f":"_xlfn.IFS('Product benefit & adoption'!$G$4=\"ALL\",'Product benefit & adoption'!AB27*'Product benefit & adoption'!$P27/1000000,'Product benefit & adoption'!$G$4=\"2020-25\",'Product benefit & adoption'!AB27*'Product benefit & adoption'!$N27/1000000,'Product benefit & adoption'!$G$4=\"2015-20\",'Product benefit & adoption'!AB27*'Product benefit & adoption'!$L27/1000000)","v":0},{"$f":"_xlfn.IFS('Product benefit & adoption'!$G$4=\"ALL\",'Product benefit & adoption'!AC27*'Product benefit & adoption'!$P27/1000000,'Product benefit & adoption'!$G$4=\"2020-25\",'Product benefit & adoption'!AC27*'Product benefit & adoption'!$N27/1000000,'Product benefit & adoption'!$G$4=\"2015-20\",'Product benefit & adoption'!AC27*'Product benefit & adoption'!$L27/1000000)","v":0},{"$f":"_xlfn.IFS('Product benefit & adoption'!$G$4=\"ALL\",'Product benefit & adoption'!AD27*'Product benefit & adoption'!$P27/1000000,'Product benefit & adoption'!$G$4=\"2020-25\",'Product benefit & adoption'!AD27*'Product benefit & adoption'!$N27/1000000,'Product benefit & adoption'!$G$4=\"2015-20\",'Product benefit & adoption'!AD27*'Product benefit & adoption'!$L27/1000000)","v":0},{"$f":"_xlfn.IFS('Product benefit & adoption'!$G$4=\"ALL\",'Product benefit & adoption'!AE27*'Product benefit & adoption'!$P27/1000000,'Product benefit & adoption'!$G$4=\"2020-25\",'Product benefit & adoption'!AE27*'Product benefit & adoption'!$N27/1000000,'Product benefit & adoption'!$G$4=\"2015-20\",'Product benefit & adoption'!AE27*'Product benefit & adoption'!$L27/1000000)","v":0},{"$f":"_xlfn.IFS('Product benefit & adoption'!$G$4=\"ALL\",'Product benefit & adoption'!AF27*'Product benefit & adoption'!$P27/1000000,'Product benefit & adoption'!$G$4=\"2020-25\",'Product benefit & adoption'!AF27*'Product benefit & adoption'!$N27/1000000,'Product benefit & adoption'!$G$4=\"2015-20\",'Product benefit & adoption'!AF27*'Product benefit & adoption'!$L27/1000000)","v":0},{"$f":"_xlfn.IFS('Product benefit & adoption'!$G$4=\"ALL\",'Product benefit & adoption'!AG27*'Product benefit & adoption'!$P27/1000000,'Product benefit & adoption'!$G$4=\"2020-25\",'Product benefit & adoption'!AG27*'Product benefit & adoption'!$N27/1000000,'Product benefit & adoption'!$G$4=\"2015-20\",'Product benefit & adoption'!AG27*'Product benefit & adoption'!$L27/1000000)","v":0},{"$f":"_xlfn.IFS('Product benefit & adoption'!$G$4=\"ALL\",'Product benefit & adoption'!AH27*'Product benefit & adoption'!$P27/1000000,'Product benefit & adoption'!$G$4=\"2020-25\",'Product benefit & adoption'!AH27*'Product benefit & adoption'!$N27/1000000,'Product benefit & adoption'!$G$4=\"2015-20\",'Product benefit & adoption'!AH27*'Product benefit & adoption'!$L27/1000000)","v":0},{"$f":"_xlfn.IFS('Product benefit & adoption'!$G$4=\"ALL\",'Product benefit & adoption'!AI27*'Product benefit & adoption'!$P27/1000000,'Product benefit & adoption'!$G$4=\"2020-25\",'Product benefit & adoption'!AI27*'Product benefit & adoption'!$N27/1000000,'Product benefit & adoption'!$G$4=\"2015-20\",'Product benefit & adoption'!AI27*'Product benefit & adoption'!$L27/1000000)","v":0},{"$f":"_xlfn.IFS('Product benefit & adoption'!$G$4=\"ALL\",'Product benefit & adoption'!AJ27*'Product benefit & adoption'!$P27/1000000,'Product benefit & adoption'!$G$4=\"2020-25\",'Product benefit & adoption'!AJ27*'Product benefit & adoption'!$N27/1000000,'Product benefit & adoption'!$G$4=\"2015-20\",'Product benefit & adoption'!AJ27*'Product benefit & adoption'!$L27/1000000)","v":0},{"$f":"_xlfn.IFS('Product benefit & adoption'!$G$4=\"ALL\",'Product benefit & adoption'!AK27*'Product benefit & adoption'!$P27/1000000,'Product benefit & adoption'!$G$4=\"2020-25\",'Product benefit & adoption'!AK27*'Product benefit & adoption'!$N27/1000000,'Product benefit & adoption'!$G$4=\"2015-20\",'Product benefit & adoption'!AK27*'Product benefit & adoption'!$L27/1000000)","v":0},{"$f":"_xlfn.IFS('Product benefit & adoption'!$G$4=\"ALL\",'Product benefit & adoption'!AL27*'Product benefit & adoption'!$P27/1000000,'Product benefit & adoption'!$G$4=\"2020-25\",'Product benefit & adoption'!AL27*'Product benefit & adoption'!$N27/1000000,'Product benefit & adoption'!$G$4=\"2015-20\",'Product benefit & adoption'!AL27*'Product benefit & adoption'!$L27/1000000)","v":0},{"$f":"_xlfn.IFS('Product benefit & adoption'!$G$4=\"ALL\",'Product benefit & adoption'!AM27*'Product benefit & adoption'!$P27/1000000,'Product benefit & adoption'!$G$4=\"2020-25\",'Product benefit & adoption'!AM27*'Product benefit & adoption'!$N27/1000000,'Product benefit & adoption'!$G$4=\"2015-20\",'Product benefit & adoption'!AM27*'Product benefit & adoption'!$L27/1000000)","v":0},{"$f":"_xlfn.IFS('Product benefit & adoption'!$G$4=\"ALL\",'Product benefit & adoption'!AN27*'Product benefit & adoption'!$P27/1000000,'Product benefit & adoption'!$G$4=\"2020-25\",'Product benefit & adoption'!AN27*'Product benefit & adoption'!$N27/1000000,'Product benefit & adoption'!$G$4=\"2015-20\",'Product benefit & adoption'!AN27*'Product benefit & adoption'!$L27/1000000)","v":0},{"$f":"_xlfn.IFS('Product benefit & adoption'!$G$4=\"ALL\",'Product benefit & adoption'!AO27*'Product benefit & adoption'!$P27/1000000,'Product benefit & adoption'!$G$4=\"2020-25\",'Product benefit & adoption'!AO27*'Product benefit & adoption'!$N27/1000000,'Product benefit & adoption'!$G$4=\"2015-20\",'Product benefit & adoption'!AO27*'Product benefit & adoption'!$L27/1000000)","v":0},{"$f":"_xlfn.IFS('Product benefit & adoption'!$G$4=\"ALL\",'Product benefit & adoption'!AP27*'Product benefit & adoption'!$P27/1000000,'Product benefit & adoption'!$G$4=\"2020-25\",'Product benefit & adoption'!AP27*'Product benefit & adoption'!$N27/1000000,'Product benefit & adoption'!$G$4=\"2015-20\",'Product benefit & adoption'!AP27*'Product benefit & adoption'!$L27/1000000)","v":0},{"$f":"_xlfn.IFS('Product benefit & adoption'!$G$4=\"ALL\",'Product benefit & adoption'!AQ27*'Product benefit & adoption'!$P27/1000000,'Product benefit & adoption'!$G$4=\"2020-25\",'Product benefit & adoption'!AQ27*'Product benefit & adoption'!$N27/1000000,'Product benefit & adoption'!$G$4=\"2015-20\",'Product benefit & adoption'!AQ27*'Product benefit & adoption'!$L27/1000000)","v":0},{"$f":"_xlfn.IFS('Product benefit & adoption'!$G$4=\"ALL\",'Product benefit & adoption'!AR27*'Product benefit & adoption'!$P27/1000000,'Product benefit & adoption'!$G$4=\"2020-25\",'Product benefit & adoption'!AR27*'Product benefit & adoption'!$N27/1000000,'Product benefit & adoption'!$G$4=\"2015-20\",'Product benefit & adoption'!AR27*'Product benefit & adoption'!$L27/1000000)","v":0},{"$f":"_xlfn.IFS('Product benefit & adoption'!$G$4=\"ALL\",'Product benefit & adoption'!AS27*'Product benefit & adoption'!$P27/1000000,'Product benefit & adoption'!$G$4=\"2020-25\",'Product benefit & adoption'!AS27*'Product benefit & adoption'!$N27/1000000,'Product benefit & adoption'!$G$4=\"2015-20\",'Product benefit & adoption'!AS27*'Product benefit & adoption'!$L27/1000000)","v":0},{"$f":"_xlfn.IFS('Product benefit & adoption'!$G$4=\"ALL\",'Product benefit & adoption'!AT27*'Product benefit & adoption'!$P27/1000000,'Product benefit & adoption'!$G$4=\"2020-25\",'Product benefit & adoption'!AT27*'Product benefit & adoption'!$N27/1000000,'Product benefit & adoption'!$G$4=\"2015-20\",'Product benefit & adoption'!AT27*'Product benefit & adoption'!$L27/1000000)","v":0},{"$f":"_xlfn.IFS('Product benefit & adoption'!$G$4=\"ALL\",'Product benefit & adoption'!AU27*'Product benefit & adoption'!$P27/1000000,'Product benefit & adoption'!$G$4=\"2020-25\",'Product benefit & adoption'!AU27*'Product benefit & adoption'!$N27/1000000,'Product benefit & adoption'!$G$4=\"2015-20\",'Product benefit & adoption'!AU27*'Product benefit & adoption'!$L27/1000000)","v":0},{"$f":"_xlfn.IFS('Product benefit & adoption'!$G$4=\"ALL\",'Product benefit & adoption'!AV27*'Product benefit & adoption'!$P27/1000000,'Product benefit & adoption'!$G$4=\"2020-25\",'Product benefit & adoption'!AV27*'Product benefit & adoption'!$N27/1000000,'Product benefit & adoption'!$G$4=\"2015-20\",'Product benefit & adoption'!AV27*'Product benefit & adoption'!$L27/1000000)","v":0},{"$f":"_xlfn.IFS('Product benefit & adoption'!$G$4=\"ALL\",'Product benefit & adoption'!AW27*'Product benefit & adoption'!$P27/1000000,'Product benefit & adoption'!$G$4=\"2020-25\",'Product benefit & adoption'!AW27*'Product benefit & adoption'!$N27/1000000,'Product benefit & adoption'!$G$4=\"2015-20\",'Product benefit & adoption'!AW27*'Product benefit & adoption'!$L27/1000000)","v":0},{"$f":"_xlfn.IFS('Product benefit & adoption'!$G$4=\"ALL\",'Product benefit & adoption'!AX27*'Product benefit & adoption'!$P27/1000000,'Product benefit & adoption'!$G$4=\"2020-25\",'Product benefit & adoption'!AX27*'Product benefit & adoption'!$N27/1000000,'Product benefit & adoption'!$G$4=\"2015-20\",'Product benefit & adoption'!AX27*'Product benefit & adoption'!$L27/1000000)","v":0},{"$f":"_xlfn.IFS('Product benefit & adoption'!$G$4=\"ALL\",'Product benefit & adoption'!AY27*'Product benefit & adoption'!$P27/1000000,'Product benefit & adoption'!$G$4=\"2020-25\",'Product benefit & adoption'!AY27*'Product benefit & adoption'!$N27/1000000,'Product benefit & adoption'!$G$4=\"2015-20\",'Product benefit & adoption'!AY27*'Product benefit & adoption'!$L27/1000000)","v":0},{"$f":"_xlfn.IFS('Product benefit & adoption'!$G$4=\"ALL\",'Product benefit & adoption'!AZ27*'Product benefit & adoption'!$P27/1000000,'Product benefit & adoption'!$G$4=\"2020-25\",'Product benefit & adoption'!AZ27*'Product benefit & adoption'!$N27/1000000,'Product benefit & adoption'!$G$4=\"2015-20\",'Product benefit & adoption'!AZ27*'Product benefit & adoption'!$L27/1000000)","v":0},{"$f":"_xlfn.IFS('Product benefit & adoption'!$G$4=\"ALL\",'Product benefit & adoption'!BA27*'Product benefit & adoption'!$P27/1000000,'Product benefit & adoption'!$G$4=\"2020-25\",'Product benefit & adoption'!BA27*'Product benefit & adoption'!$N27/1000000,'Product benefit & adoption'!$G$4=\"2015-20\",'Product benefit & adoption'!BA27*'Product benefit & adoption'!$L27/1000000)","v":0},{"$f":"_xlfn.IFS('Product benefit & adoption'!$G$4=\"ALL\",'Product benefit & adoption'!BB27*'Product benefit & adoption'!$P27/1000000,'Product benefit & adoption'!$G$4=\"2020-25\",'Product benefit & adoption'!BB27*'Product benefit & adoption'!$N27/1000000,'Product benefit & adoption'!$G$4=\"2015-20\",'Product benefit & adoption'!BB27*'Product benefit & adoption'!$L27/1000000)","v":0},{"$f":"_xlfn.IFS('Product benefit & adoption'!$G$4=\"ALL\",'Product benefit & adoption'!BC27*'Product benefit & adoption'!$P27/1000000,'Product benefit & adoption'!$G$4=\"2020-25\",'Product benefit & adoption'!BC27*'Product benefit & adoption'!$N27/1000000,'Product benefit & adoption'!$G$4=\"2015-20\",'Product benefit & adoption'!BC27*'Product benefit & adoption'!$L27/1000000)","v":0},{"$f":"_xlfn.IFS('Product benefit & adoption'!$G$4=\"ALL\",'Product benefit & adoption'!BD27*'Product benefit & adoption'!$P27/1000000,'Product benefit & adoption'!$G$4=\"2020-25\",'Product benefit & adoption'!BD27*'Product benefit & adoption'!$N27/1000000,'Product benefit & adoption'!$G$4=\"2015-20\",'Product benefit & adoption'!BD27*'Product benefit & adoption'!$L27/1000000)","v":0}]
[null,18,{"$f":"IF('Product benefit & adoption'!D28=\"\",\"\",'Product benefit & adoption'!D28)","v":""},{"$f":"IF('Product benefit & adoption'!F28=\"\",\"\",'Product benefit & adoption'!F28)","v":""},0,{"$f":"_xlfn.IFS('Product benefit & adoption'!$G$4=\"ALL\",'Product benefit & adoption'!AA28*'Product benefit & adoption'!$P28/1000000,'Product benefit & adoption'!$G$4=\"2020-25\",'Product benefit & adoption'!AA28*'Product benefit & adoption'!$N28/1000000,'Product benefit & adoption'!$G$4=\"2015-20\",'Product benefit & adoption'!AA28*'Product benefit & adoption'!$L28/1000000)","v":0},{"$f":"_xlfn.IFS('Product benefit & adoption'!$G$4=\"ALL\",'Product benefit & adoption'!AB28*'Product benefit & adoption'!$P28/1000000,'Product benefit & adoption'!$G$4=\"2020-25\",'Product benefit & adoption'!AB28*'Product benefit & adoption'!$N28/1000000,'Product benefit & adoption'!$G$4=\"2015-20\",'Product benefit & adoption'!AB28*'Product benefit & adoption'!$L28/1000000)","v":0},{"$f":"_xlfn.IFS('Product benefit & adoption'!$G$4=\"ALL\",'Product benefit & adoption'!AC28*'Product benefit & adoption'!$P28/1000000,'Product benefit & adoption'!$G$4=\"2020-25\",'Product benefit & adoption'!AC28*'Product benefit & adoption'!$N28/1000000,'Product benefit & adoption'!$G$4=\"2015-20\",'Product benefit & adoption'!AC28*'Product benefit & adoption'!$L28/1000000)","v":0},{"$f":"_xlfn.IFS('Product benefit & adoption'!$G$4=\"ALL\",'Product benefit & adoption'!AD28*'Product benefit & adoption'!$P28/1000000,'Product benefit & adoption'!$G$4=\"2020-25\",'Product benefit & adoption'!AD28*'Product benefit & adoption'!$N28/1000000,'Product benefit & adoption'!$G$4=\"2015-20\",'Product benefit & adoption'!AD28*'Product benefit & adoption'!$L28/1000000)","v":0},{"$f":"_xlfn.IFS('Product benefit & adoption'!$G$4=\"ALL\",'Product benefit & adoption'!AE28*'Product benefit & adoption'!$P28/1000000,'Product benefit & adoption'!$G$4=\"2020-25\",'Product benefit & adoption'!AE28*'Product benefit & adoption'!$N28/1000000,'Product benefit & adoption'!$G$4=\"2015-20\",'Product benefit & adoption'!AE28*'Product benefit & adoption'!$L28/1000000)","v":0},{"$f":"_xlfn.IFS('Product benefit & adoption'!$G$4=\"ALL\",'Product benefit & adoption'!AF28*'Product benefit & adoption'!$P28/1000000,'Product benefit & adoption'!$G$4=\"2020-25\",'Product benefit & adoption'!AF28*'Product benefit & adoption'!$N28/1000000,'Product benefit & adoption'!$G$4=\"2015-20\",'Product benefit & adoption'!AF28*'Product benefit & adoption'!$L28/1000000)","v":0},{"$f":"_xlfn.IFS('Product benefit & adoption'!$G$4=\"ALL\",'Product benefit & adoption'!AG28*'Product benefit & adoption'!$P28/1000000,'Product benefit & adoption'!$G$4=\"2020-25\",'Product benefit & adoption'!AG28*'Product benefit & adoption'!$N28/1000000,'Product benefit & adoption'!$G$4=\"2015-20\",'Product benefit & adoption'!AG28*'Product benefit & adoption'!$L28/1000000)","v":0},{"$f":"_xlfn.IFS('Product benefit & adoption'!$G$4=\"ALL\",'Product benefit & adoption'!AH28*'Product benefit & adoption'!$P28/1000000,'Product benefit & adoption'!$G$4=\"2020-25\",'Product benefit & adoption'!AH28*'Product benefit & adoption'!$N28/1000000,'Product benefit & adoption'!$G$4=\"2015-20\",'Product benefit & adoption'!AH28*'Product benefit & adoption'!$L28/1000000)","v":0},{"$f":"_xlfn.IFS('Product benefit & adoption'!$G$4=\"ALL\",'Product benefit & adoption'!AI28*'Product benefit & adoption'!$P28/1000000,'Product benefit & adoption'!$G$4=\"2020-25\",'Product benefit & adoption'!AI28*'Product benefit & adoption'!$N28/1000000,'Product benefit & adoption'!$G$4=\"2015-20\",'Product benefit & adoption'!AI28*'Product benefit & adoption'!$L28/1000000)","v":0},{"$f":"_xlfn.IFS('Product benefit & adoption'!$G$4=\"ALL\",'Product benefit & adoption'!AJ28*'Product benefit & adoption'!$P28/1000000,'Product benefit & adoption'!$G$4=\"2020-25\",'Product benefit & adoption'!AJ28*'Product benefit & adoption'!$N28/1000000,'Product benefit & adoption'!$G$4=\"2015-20\",'Product benefit & adoption'!AJ28*'Product benefit & adoption'!$L28/1000000)","v":0},{"$f":"_xlfn.IFS('Product benefit & adoption'!$G$4=\"ALL\",'Product benefit & adoption'!AK28*'Product benefit & adoption'!$P28/1000000,'Product benefit & adoption'!$G$4=\"2020-25\",'Product benefit & adoption'!AK28*'Product benefit & adoption'!$N28/1000000,'Product benefit & adoption'!$G$4=\"2015-20\",'Product benefit & adoption'!AK28*'Product benefit & adoption'!$L28/1000000)","v":0},{"$f":"_xlfn.IFS('Product benefit & adoption'!$G$4=\"ALL\",'Product benefit & adoption'!AL28*'Product benefit & adoption'!$P28/1000000,'Product benefit & adoption'!$G$4=\"2020-25\",'Product benefit & adoption'!AL28*'Product benefit & adoption'!$N28/1000000,'Product benefit & adoption'!$G$4=\"2015-20\",'Product benefit & adoption'!AL28*'Product benefit & adoption'!$L28/1000000)","v":0},{"$f":"_xlfn.IFS('Product benefit & adoption'!$G$4=\"ALL\",'Product benefit & adoption'!AM28*'Product benefit & adoption'!$P28/1000000,'Product benefit & adoption'!$G$4=\"2020-25\",'Product benefit & adoption'!AM28*'Product benefit & adoption'!$N28/1000000,'Product benefit & adoption'!$G$4=\"2015-20\",'Product benefit & adoption'!AM28*'Product benefit & adoption'!$L28/1000000)","v":0},{"$f":"_xlfn.IFS('Product benefit & adoption'!$G$4=\"ALL\",'Product benefit & adoption'!AN28*'Product benefit & adoption'!$P28/1000000,'Product benefit & adoption'!$G$4=\"2020-25\",'Product benefit & adoption'!AN28*'Product benefit & adoption'!$N28/1000000,'Product benefit & adoption'!$G$4=\"2015-20\",'Product benefit & adoption'!AN28*'Product benefit & adoption'!$L28/1000000)","v":0},{"$f":"_xlfn.IFS('Product benefit & adoption'!$G$4=\"ALL\",'Product benefit & adoption'!AO28*'Product benefit & adoption'!$P28/1000000,'Product benefit & adoption'!$G$4=\"2020-25\",'Product benefit & adoption'!AO28*'Product benefit & adoption'!$N28/1000000,'Product benefit & adoption'!$G$4=\"2015-20\",'Product benefit & adoption'!AO28*'Product benefit & adoption'!$L28/1000000)","v":0},{"$f":"_xlfn.IFS('Product benefit & adoption'!$G$4=\"ALL\",'Product benefit & adoption'!AP28*'Product benefit & adoption'!$P28/1000000,'Product benefit & adoption'!$G$4=\"2020-25\",'Product benefit & adoption'!AP28*'Product benefit & adoption'!$N28/1000000,'Product benefit & adoption'!$G$4=\"2015-20\",'Product benefit & adoption'!AP28*'Product benefit & adoption'!$L28/1000000)","v":0},{"$f":"_xlfn.IFS('Product benefit & adoption'!$G$4=\"ALL\",'Product benefit & adoption'!AQ28*'Product benefit & adoption'!$P28/1000000,'Product benefit & adoption'!$G$4=\"2020-25\",'Product benefit & adoption'!AQ28*'Product benefit & adoption'!$N28/1000000,'Product benefit & adoption'!$G$4=\"2015-20\",'Product benefit & adoption'!AQ28*'Product benefit & adoption'!$L28/1000000)","v":0},{"$f":"_xlfn.IFS('Product benefit & adoption'!$G$4=\"ALL\",'Product benefit & adoption'!AR28*'Product benefit & adoption'!$P28/1000000,'Product benefit & adoption'!$G$4=\"2020-25\",'Product benefit & adoption'!AR28*'Product benefit & adoption'!$N28/1000000,'Product benefit & adoption'!$G$4=\"2015-20\",'Product benefit & adoption'!AR28*'Product benefit & adoption'!$L28/1000000)","v":0},{"$f":"_xlfn.IFS('Product benefit & adoption'!$G$4=\"ALL\",'Product benefit & adoption'!AS28*'Product benefit & adoption'!$P28/1000000,'Product benefit & adoption'!$G$4=\"2020-25\",'Product benefit & adoption'!AS28*'Product benefit & adoption'!$N28/1000000,'Product benefit & adoption'!$G$4=\"2015-20\",'Product benefit & adoption'!AS28*'Product benefit & adoption'!$L28/1000000)","v":0},{"$f":"_xlfn.IFS('Product benefit & adoption'!$G$4=\"ALL\",'Product benefit & adoption'!AT28*'Product benefit & adoption'!$P28/1000000,'Product benefit & adoption'!$G$4=\"2020-25\",'Product benefit & adoption'!AT28*'Product benefit & adoption'!$N28/1000000,'Product benefit & adoption'!$G$4=\"2015-20\",'Product benefit & adoption'!AT28*'Product benefit & adoption'!$L28/1000000)","v":0},{"$f":"_xlfn.IFS('Product benefit & adoption'!$G$4=\"ALL\",'Product benefit & adoption'!AU28*'Product benefit & adoption'!$P28/1000000,'Product benefit & adoption'!$G$4=\"2020-25\",'Product benefit & adoption'!AU28*'Product benefit & adoption'!$N28/1000000,'Product benefit & adoption'!$G$4=\"2015-20\",'Product benefit & adoption'!AU28*'Product benefit & adoption'!$L28/1000000)","v":0},{"$f":"_xlfn.IFS('Product benefit & adoption'!$G$4=\"ALL\",'Product benefit & adoption'!AV28*'Product benefit & adoption'!$P28/1000000,'Product benefit & adoption'!$G$4=\"2020-25\",'Product benefit & adoption'!AV28*'Product benefit & adoption'!$N28/1000000,'Product benefit & adoption'!$G$4=\"2015-20\",'Product benefit & adoption'!AV28*'Product benefit & adoption'!$L28/1000000)","v":0},{"$f":"_xlfn.IFS('Product benefit & adoption'!$G$4=\"ALL\",'Product benefit & adoption'!AW28*'Product benefit & adoption'!$P28/1000000,'Product benefit & adoption'!$G$4=\"2020-25\",'Product benefit & adoption'!AW28*'Product benefit & adoption'!$N28/1000000,'Product benefit & adoption'!$G$4=\"2015-20\",'Product benefit & adoption'!AW28*'Product benefit & adoption'!$L28/1000000)","v":0},{"$f":"_xlfn.IFS('Product benefit & adoption'!$G$4=\"ALL\",'Product benefit & adoption'!AX28*'Product benefit & adoption'!$P28/1000000,'Product benefit & adoption'!$G$4=\"2020-25\",'Product benefit & adoption'!AX28*'Product benefit & adoption'!$N28/1000000,'Product benefit & adoption'!$G$4=\"2015-20\",'Product benefit & adoption'!AX28*'Product benefit & adoption'!$L28/1000000)","v":0},{"$f":"_xlfn.IFS('Product benefit & adoption'!$G$4=\"ALL\",'Product benefit & adoption'!AY28*'Product benefit & adoption'!$P28/1000000,'Product benefit & adoption'!$G$4=\"2020-25\",'Product benefit & adoption'!AY28*'Product benefit & adoption'!$N28/1000000,'Product benefit & adoption'!$G$4=\"2015-20\",'Product benefit & adoption'!AY28*'Product benefit & adoption'!$L28/1000000)","v":0},{"$f":"_xlfn.IFS('Product benefit & adoption'!$G$4=\"ALL\",'Product benefit & adoption'!AZ28*'Product benefit & adoption'!$P28/1000000,'Product benefit & adoption'!$G$4=\"2020-25\",'Product benefit & adoption'!AZ28*'Product benefit & adoption'!$N28/1000000,'Product benefit & adoption'!$G$4=\"2015-20\",'Product benefit & adoption'!AZ28*'Product benefit & adoption'!$L28/1000000)","v":0},{"$f":"_xlfn.IFS('Product benefit & adoption'!$G$4=\"ALL\",'Product benefit & adoption'!BA28*'Product benefit & adoption'!$P28/1000000,'Product benefit & adoption'!$G$4=\"2020-25\",'Product benefit & adoption'!BA28*'Product benefit & adoption'!$N28/1000000,'Product benefit & adoption'!$G$4=\"2015-20\",'Product benefit & adoption'!BA28*'Product benefit & adoption'!$L28/1000000)","v":0},{"$f":"_xlfn.IFS('Product benefit & adoption'!$G$4=\"ALL\",'Product benefit & adoption'!BB28*'Product benefit & adoption'!$P28/1000000,'Product benefit & adoption'!$G$4=\"2020-25\",'Product benefit & adoption'!BB28*'Product benefit & adoption'!$N28/1000000,'Product benefit & adoption'!$G$4=\"2015-20\",'Product benefit & adoption'!BB28*'Product benefit & adoption'!$L28/1000000)","v":0},{"$f":"_xlfn.IFS('Product benefit & adoption'!$G$4=\"ALL\",'Product benefit & adoption'!BC28*'Product benefit & adoption'!$P28/1000000,'Product benefit & adoption'!$G$4=\"2020-25\",'Product benefit & adoption'!BC28*'Product benefit & adoption'!$N28/1000000,'Product benefit & adoption'!$G$4=\"2015-20\",'Product benefit & adoption'!BC28*'Product benefit & adoption'!$L28/1000000)","v":0},{"$f":"_xlfn.IFS('Product benefit & adoption'!$G$4=\"ALL\",'Product benefit & adoption'!BD28*'Product benefit & adoption'!$P28/1000000,'Product benefit & adoption'!$G$4=\"2020-25\",'Product benefit & adoption'!BD28*'Product benefit & adoption'!$N28/1000000,'Product benefit & adoption'!$G$4=\"2015-20\",'Product benefit & adoption'!BD28*'Product benefit & adoption'!$L28/1000000)","v":0}]
[null,19,{"$f":"IF('Product benefit & adoption'!D29=\"\",\"\",'Product benefit & adoption'!D29)","v":""},{"$f":"IF('Product benefit & adoption'!F29=\"\",\"\",'Product benefit & adoption'!F29)","v":""},0,{"$f":"_xlfn.IFS('Product benefit & adoption'!$G$4=\"ALL\",'Product benefit & adoption'!AA29*'Product benefit & adoption'!$P29/1000000,'Product benefit & adoption'!$G$4=\"2020-25\",'Product benefit & adoption'!AA29*'Product benefit & adoption'!$N29/1000000,'Product benefit & adoption'!$G$4=\"2015-20\",'Product benefit & adoption'!AA29*'Product benefit & adoption'!$L29/1000000)","v":0},{"$f":"_xlfn.IFS('Product benefit & adoption'!$G$4=\"ALL\",'Product benefit & adoption'!AB29*'Product benefit & adoption'!$P29/1000000,'Product benefit & adoption'!$G$4=\"2020-25\",'Product benefit & adoption'!AB29*'Product benefit & adoption'!$N29/1000000,'Product benefit & adoption'!$G$4=\"2015-20\",'Product benefit & adoption'!AB29*'Product benefit & adoption'!$L29/1000000)","v":0},{"$f":"_xlfn.IFS('Product benefit & adoption'!$G$4=\"ALL\",'Product benefit & adoption'!AC29*'Product benefit & adoption'!$P29/1000000,'Product benefit & adoption'!$G$4=\"2020-25\",'Product benefit & adoption'!AC29*'Product benefit & adoption'!$N29/1000000,'Product benefit & adoption'!$G$4=\"2015-20\",'Product benefit & adoption'!AC29*'Product benefit & adoption'!$L29/1000000)","v":0},{"$f":"_xlfn.IFS('Product benefit & adoption'!$G$4=\"ALL\",'Product benefit & adoption'!AD29*'Product benefit & adoption'!$P29/1000000,'Product benefit & adoption'!$G$4=\"2020-25\",'Product benefit & adoption'!AD29*'Product benefit & adoption'!$N29/1000000,'Product benefit & adoption'!$G$4=\"2015-20\",'Product benefit & adoption'!AD29*'Product benefit & adoption'!$L29/1000000)","v":0},{"$f":"_xlfn.IFS('Product benefit & adoption'!$G$4=\"ALL\",'Product benefit & adoption'!AE29*'Product benefit & adoption'!$P29/1000000,'Product benefit & adoption'!$G$4=\"2020-25\",'Product benefit & adoption'!AE29*'Product benefit & adoption'!$N29/1000000,'Product benefit & adoption'!$G$4=\"2015-20\",'Product benefit & adoption'!AE29*'Product benefit & adoption'!$L29/1000000)","v":0},{"$f":"_xlfn.IFS('Product benefit & adoption'!$G$4=\"ALL\",'Product benefit & adoption'!AF29*'Product benefit & adoption'!$P29/1000000,'Product benefit & adoption'!$G$4=\"2020-25\",'Product benefit & adoption'!AF29*'Product benefit & adoption'!$N29/1000000,'Product benefit & adoption'!$G$4=\"2015-20\",'Product benefit & adoption'!AF29*'Product benefit & adoption'!$L29/1000000)","v":0},{"$f":"_xlfn.IFS('Product benefit & adoption'!$G$4=\"ALL\",'Product benefit & adoption'!AG29*'Product benefit & adoption'!$P29/1000000,'Product benefit & adoption'!$G$4=\"2020-25\",'Product benefit & adoption'!AG29*'Product benefit & adoption'!$N29/1000000,'Product benefit & adoption'!$G$4=\"2015-20\",'Product benefit & adoption'!AG29*'Product benefit & adoption'!$L29/1000000)","v":0},{"$f":"_xlfn.IFS('Product benefit & adoption'!$G$4=\"ALL\",'Product benefit & adoption'!AH29*'Product benefit & adoption'!$P29/1000000,'Product benefit & adoption'!$G$4=\"2020-25\",'Product benefit & adoption'!AH29*'Product benefit & adoption'!$N29/1000000,'Product benefit & adoption'!$G$4=\"2015-20\",'Product benefit & adoption'!AH29*'Product benefit & adoption'!$L29/1000000)","v":0},{"$f":"_xlfn.IFS('Product benefit & adoption'!$G$4=\"ALL\",'Product benefit & adoption'!AI29*'Product benefit & adoption'!$P29/1000000,'Product benefit & adoption'!$G$4=\"2020-25\",'Product benefit & adoption'!AI29*'Product benefit & adoption'!$N29/1000000,'Product benefit & adoption'!$G$4=\"2015-20\",'Product benefit & adoption'!AI29*'Product benefit & adoption'!$L29/1000000)","v":0},{"$f":"_xlfn.IFS('Product benefit & adoption'!$G$4=\"ALL\",'Product benefit & adoption'!AJ29*'Product benefit & adoption'!$P29/1000000,'Product benefit & adoption'!$G$4=\"2020-25\",'Product benefit & adoption'!AJ29*'Product benefit & adoption'!$N29/1000000,'Product benefit & adoption'!$G$4=\"2015-20\",'Product benefit & adoption'!AJ29*'Product benefit & adoption'!$L29/1000000)","v":0},{"$f":"_xlfn.IFS('Product benefit & adoption'!$G$4=\"ALL\",'Product benefit & adoption'!AK29*'Product benefit & adoption'!$P29/1000000,'Product benefit & adoption'!$G$4=\"2020-25\",'Product benefit & adoption'!AK29*'Product benefit & adoption'!$N29/1000000,'Product benefit & adoption'!$G$4=\"2015-20\",'Product benefit & adoption'!AK29*'Product benefit & adoption'!$L29/1000000)","v":0},{"$f":"_xlfn.IFS('Product benefit & adoption'!$G$4=\"ALL\",'Product benefit & adoption'!AL29*'Product benefit & adoption'!$P29/1000000,'Product benefit & adoption'!$G$4=\"2020-25\",'Product benefit & adoption'!AL29*'Product benefit & adoption'!$N29/1000000,'Product benefit & adoption'!$G$4=\"2015-20\",'Product benefit & adoption'!AL29*'Product benefit & adoption'!$L29/1000000)","v":0},{"$f":"_xlfn.IFS('Product benefit & adoption'!$G$4=\"ALL\",'Product benefit & adoption'!AM29*'Product benefit & adoption'!$P29/1000000,'Product benefit & adoption'!$G$4=\"2020-25\",'Product benefit & adoption'!AM29*'Product benefit & adoption'!$N29/1000000,'Product benefit & adoption'!$G$4=\"2015-20\",'Product benefit & adoption'!AM29*'Product benefit & adoption'!$L29/1000000)","v":0},{"$f":"_xlfn.IFS('Product benefit & adoption'!$G$4=\"ALL\",'Product benefit & adoption'!AN29*'Product benefit & adoption'!$P29/1000000,'Product benefit & adoption'!$G$4=\"2020-25\",'Product benefit & adoption'!AN29*'Product benefit & adoption'!$N29/1000000,'Product benefit & adoption'!$G$4=\"2015-20\",'Product benefit & adoption'!AN29*'Product benefit & adoption'!$L29/1000000)","v":0},{"$f":"_xlfn.IFS('Product benefit & adoption'!$G$4=\"ALL\",'Product benefit & adoption'!AO29*'Product benefit & adoption'!$P29/1000000,'Product benefit & adoption'!$G$4=\"2020-25\",'Product benefit & adoption'!AO29*'Product benefit & adoption'!$N29/1000000,'Product benefit & adoption'!$G$4=\"2015-20\",'Product benefit & adoption'!AO29*'Product benefit & adoption'!$L29/1000000)","v":0},{"$f":"_xlfn.IFS('Product benefit & adoption'!$G$4=\"ALL\",'Product benefit & adoption'!AP29*'Product benefit & adoption'!$P29/1000000,'Product benefit & adoption'!$G$4=\"2020-25\",'Product benefit & adoption'!AP29*'Product benefit & adoption'!$N29/1000000,'Product benefit & adoption'!$G$4=\"2015-20\",'Product benefit & adoption'!AP29*'Product benefit & adoption'!$L29/1000000)","v":0},{"$f":"_xlfn.IFS('Product benefit & adoption'!$G$4=\"ALL\",'Product benefit & adoption'!AQ29*'Product benefit & adoption'!$P29/1000000,'Product benefit & adoption'!$G$4=\"2020-25\",'Product benefit & adoption'!AQ29*'Product benefit & adoption'!$N29/1000000,'Product benefit & adoption'!$G$4=\"2015-20\",'Product benefit & adoption'!AQ29*'Product benefit & adoption'!$L29/1000000)","v":0},{"$f":"_xlfn.IFS('Product benefit & adoption'!$G$4=\"ALL\",'Product benefit & adoption'!AR29*'Product benefit & adoption'!$P29/1000000,'Product benefit & adoption'!$G$4=\"2020-25\",'Product benefit & adoption'!AR29*'Product benefit & adoption'!$N29/1000000,'Product benefit & adoption'!$G$4=\"2015-20\",'Product benefit & adoption'!AR29*'Product benefit & adoption'!$L29/1000000)","v":0},{"$f":"_xlfn.IFS('Product benefit & adoption'!$G$4=\"ALL\",'Product benefit & adoption'!AS29*'Product benefit & adoption'!$P29/1000000,'Product benefit & adoption'!$G$4=\"2020-25\",'Product benefit & adoption'!AS29*'Product benefit & adoption'!$N29/1000000,'Product benefit & adoption'!$G$4=\"2015-20\",'Product benefit & adoption'!AS29*'Product benefit & adoption'!$L29/1000000)","v":0},{"$f":"_xlfn.IFS('Product benefit & adoption'!$G$4=\"ALL\",'Product benefit & adoption'!AT29*'Product benefit & adoption'!$P29/1000000,'Product benefit & adoption'!$G$4=\"2020-25\",'Product benefit & adoption'!AT29*'Product benefit & adoption'!$N29/1000000,'Product benefit & adoption'!$G$4=\"2015-20\",'Product benefit & adoption'!AT29*'Product benefit & adoption'!$L29/1000000)","v":0},{"$f":"_xlfn.IFS('Product benefit & adoption'!$G$4=\"ALL\",'Product benefit & adoption'!AU29*'Product benefit & adoption'!$P29/1000000,'Product benefit & adoption'!$G$4=\"2020-25\",'Product benefit & adoption'!AU29*'Product benefit & adoption'!$N29/1000000,'Product benefit & adoption'!$G$4=\"2015-20\",'Product benefit & adoption'!AU29*'Product benefit & adoption'!$L29/1000000)","v":0},{"$f":"_xlfn.IFS('Product benefit & adoption'!$G$4=\"ALL\",'Product benefit & adoption'!AV29*'Product benefit & adoption'!$P29/1000000,'Product benefit & adoption'!$G$4=\"2020-25\",'Product benefit & adoption'!AV29*'Product benefit & adoption'!$N29/1000000,'Product benefit & adoption'!$G$4=\"2015-20\",'Product benefit & adoption'!AV29*'Product benefit & adoption'!$L29/1000000)","v":0},{"$f":"_xlfn.IFS('Product benefit & adoption'!$G$4=\"ALL\",'Product benefit & adoption'!AW29*'Product benefit & adoption'!$P29/1000000,'Product benefit & adoption'!$G$4=\"2020-25\",'Product benefit & adoption'!AW29*'Product benefit & adoption'!$N29/1000000,'Product benefit & adoption'!$G$4=\"2015-20\",'Product benefit & adoption'!AW29*'Product benefit & adoption'!$L29/1000000)","v":0},{"$f":"_xlfn.IFS('Product benefit & adoption'!$G$4=\"ALL\",'Product benefit & adoption'!AX29*'Product benefit & adoption'!$P29/1000000,'Product benefit & adoption'!$G$4=\"2020-25\",'Product benefit & adoption'!AX29*'Product benefit & adoption'!$N29/1000000,'Product benefit & adoption'!$G$4=\"2015-20\",'Product benefit & adoption'!AX29*'Product benefit & adoption'!$L29/1000000)","v":0},{"$f":"_xlfn.IFS('Product benefit & adoption'!$G$4=\"ALL\",'Product benefit & adoption'!AY29*'Product benefit & adoption'!$P29/1000000,'Product benefit & adoption'!$G$4=\"2020-25\",'Product benefit & adoption'!AY29*'Product benefit & adoption'!$N29/1000000,'Product benefit & adoption'!$G$4=\"2015-20\",'Product benefit & adoption'!AY29*'Product benefit & adoption'!$L29/1000000)","v":0},{"$f":"_xlfn.IFS('Product benefit & adoption'!$G$4=\"ALL\",'Product benefit & adoption'!AZ29*'Product benefit & adoption'!$P29/1000000,'Product benefit & adoption'!$G$4=\"2020-25\",'Product benefit & adoption'!AZ29*'Product benefit & adoption'!$N29/1000000,'Product benefit & adoption'!$G$4=\"2015-20\",'Product benefit & adoption'!AZ29*'Product benefit & adoption'!$L29/1000000)","v":0},{"$f":"_xlfn.IFS('Product benefit & adoption'!$G$4=\"ALL\",'Product benefit & adoption'!BA29*'Product benefit & adoption'!$P29/1000000,'Product benefit & adoption'!$G$4=\"2020-25\",'Product benefit & adoption'!BA29*'Product benefit & adoption'!$N29/1000000,'Product benefit & adoption'!$G$4=\"2015-20\",'Product benefit & adoption'!BA29*'Product benefit & adoption'!$L29/1000000)","v":0},{"$f":"_xlfn.IFS('Product benefit & adoption'!$G$4=\"ALL\",'Product benefit & adoption'!BB29*'Product benefit & adoption'!$P29/1000000,'Product benefit & adoption'!$G$4=\"2020-25\",'Product benefit & adoption'!BB29*'Product benefit & adoption'!$N29/1000000,'Product benefit & adoption'!$G$4=\"2015-20\",'Product benefit & adoption'!BB29*'Product benefit & adoption'!$L29/1000000)","v":0},{"$f":"_xlfn.IFS('Product benefit & adoption'!$G$4=\"ALL\",'Product benefit & adoption'!BC29*'Product benefit & adoption'!$P29/1000000,'Product benefit & adoption'!$G$4=\"2020-25\",'Product benefit & adoption'!BC29*'Product benefit & adoption'!$N29/1000000,'Product benefit & adoption'!$G$4=\"2015-20\",'Product benefit & adoption'!BC29*'Product benefit & adoption'!$L29/1000000)","v":0},{"$f":"_xlfn.IFS('Product benefit & adoption'!$G$4=\"ALL\",'Product benefit & adoption'!BD29*'Product benefit & adoption'!$P29/1000000,'Product benefit & adoption'!$G$4=\"2020-25\",'Product benefit & adoption'!BD29*'Product benefit & adoption'!$N29/1000000,'Product benefit & adoption'!$G$4=\"2015-20\",'Product benefit & adoption'!BD29*'Product benefit & adoption'!$L29/1000000)","v":0}]
[null,20,{"$f":"IF('Product benefit & adoption'!D30=\"\",\"\",'Product benefit & adoption'!D30)","v":""},{"$f":"IF('Product benefit & adoption'!F30=\"\",\"\",'Product benefit & adoption'!F30)","v":""},0,{"$f":"_xlfn.IFS('Product benefit & adoption'!$G$4=\"ALL\",'Product benefit & adoption'!AA30*'Product benefit & adoption'!$P30/1000000,'Product benefit & adoption'!$G$4=\"2020-25\",'Product benefit & adoption'!AA30*'Product benefit & adoption'!$N30/1000000,'Product benefit & adoption'!$G$4=\"2015-20\",'Product benefit & adoption'!AA30*'Product benefit & adoption'!$L30/1000000)","v":0},{"$f":"_xlfn.IFS('Product benefit & adoption'!$G$4=\"ALL\",'Product benefit & adoption'!AB30*'Product benefit & adoption'!$P30/1000000,'Product benefit & adoption'!$G$4=\"2020-25\",'Product benefit & adoption'!AB30*'Product benefit & adoption'!$N30/1000000,'Product benefit & adoption'!$G$4=\"2015-20\",'Product benefit & adoption'!AB30*'Product benefit & adoption'!$L30/1000000)","v":0},{"$f":"_xlfn.IFS('Product benefit & adoption'!$G$4=\"ALL\",'Product benefit & adoption'!AC30*'Product benefit & adoption'!$P30/1000000,'Product benefit & adoption'!$G$4=\"2020-25\",'Product benefit & adoption'!AC30*'Product benefit & adoption'!$N30/1000000,'Product benefit & adoption'!$G$4=\"2015-20\",'Product benefit & adoption'!AC30*'Product benefit & adoption'!$L30/1000000)","v":0},{"$f":"_xlfn.IFS('Product benefit & adoption'!$G$4=\"ALL\",'Product benefit & adoption'!AD30*'Product benefit & adoption'!$P30/1000000,'Product benefit & adoption'!$G$4=\"2020-25\",'Product benefit & adoption'!AD30*'Product benefit & adoption'!$N30/1000000,'Product benefit & adoption'!$G$4=\"2015-20\",'Product benefit & adoption'!AD30*'Product benefit & adoption'!$L30/1000000)","v":0},{"$f":"_xlfn.IFS('Product benefit & adoption'!$G$4=\"ALL\",'Product benefit & adoption'!AE30*'Product benefit & adoption'!$P30/1000000,'Product benefit & adoption'!$G$4=\"2020-25\",'Product benefit & adoption'!AE30*'Product benefit & adoption'!$N30/1000000,'Product benefit & adoption'!$G$4=\"2015-20\",'Product benefit & adoption'!AE30*'Product benefit & adoption'!$L30/1000000)","v":0},{"$f":"_xlfn.IFS('Product benefit & adoption'!$G$4=\"ALL\",'Product benefit & adoption'!AF30*'Product benefit & adoption'!$P30/1000000,'Product benefit & adoption'!$G$4=\"2020-25\",'Product benefit & adoption'!AF30*'Product benefit & adoption'!$N30/1000000,'Product benefit & adoption'!$G$4=\"2015-20\",'Product benefit & adoption'!AF30*'Product benefit & adoption'!$L30/1000000)","v":0},{"$f":"_xlfn.IFS('Product benefit & adoption'!$G$4=\"ALL\",'Product benefit & adoption'!AG30*'Product benefit & adoption'!$P30/1000000,'Product benefit & adoption'!$G$4=\"2020-25\",'Product benefit & adoption'!AG30*'Product benefit & adoption'!$N30/1000000,'Product benefit & adoption'!$G$4=\"2015-20\",'Product benefit & adoption'!AG30*'Product benefit & adoption'!$L30/1000000)","v":0},{"$f":"_xlfn.IFS('Product benefit & adoption'!$G$4=\"ALL\",'Product benefit & adoption'!AH30*'Product benefit & adoption'!$P30/1000000,'Product benefit & adoption'!$G$4=\"2020-25\",'Product benefit & adoption'!AH30*'Product benefit & adoption'!$N30/1000000,'Product benefit & adoption'!$G$4=\"2015-20\",'Product benefit & adoption'!AH30*'Product benefit & adoption'!$L30/1000000)","v":0},{"$f":"_xlfn.IFS('Product benefit & adoption'!$G$4=\"ALL\",'Product benefit & adoption'!AI30*'Product benefit & adoption'!$P30/1000000,'Product benefit & adoption'!$G$4=\"2020-25\",'Product benefit & adoption'!AI30*'Product benefit & adoption'!$N30/1000000,'Product benefit & adoption'!$G$4=\"2015-20\",'Product benefit & adoption'!AI30*'Product benefit & adoption'!$L30/1000000)","v":0},{"$f":"_xlfn.IFS('Product benefit & adoption'!$G$4=\"ALL\",'Product benefit & adoption'!AJ30*'Product benefit & adoption'!$P30/1000000,'Product benefit & adoption'!$G$4=\"2020-25\",'Product benefit & adoption'!AJ30*'Product benefit & adoption'!$N30/1000000,'Product benefit & adoption'!$G$4=\"2015-20\",'Product benefit & adoption'!AJ30*'Product benefit & adoption'!$L30/1000000)","v":0},{"$f":"_xlfn.IFS('Product benefit & adoption'!$G$4=\"ALL\",'Product benefit & adoption'!AK30*'Product benefit & adoption'!$P30/1000000,'Product benefit & adoption'!$G$4=\"2020-25\",'Product benefit & adoption'!AK30*'Product benefit & adoption'!$N30/1000000,'Product benefit & adoption'!$G$4=\"2015-20\",'Product benefit & adoption'!AK30*'Product benefit & adoption'!$L30/1000000)","v":0},{"$f":"_xlfn.IFS('Product benefit & adoption'!$G$4=\"ALL\",'Product benefit & adoption'!AL30*'Product benefit & adoption'!$P30/1000000,'Product benefit & adoption'!$G$4=\"2020-25\",'Product benefit & adoption'!AL30*'Product benefit & adoption'!$N30/1000000,'Product benefit & adoption'!$G$4=\"2015-20\",'Product benefit & adoption'!AL30*'Product benefit & adoption'!$L30/1000000)","v":0},{"$f":"_xlfn.IFS('Product benefit & adoption'!$G$4=\"ALL\",'Product benefit & adoption'!AM30*'Product benefit & adoption'!$P30/1000000,'Product benefit & adoption'!$G$4=\"2020-25\",'Product benefit & adoption'!AM30*'Product benefit & adoption'!$N30/1000000,'Product benefit & adoption'!$G$4=\"2015-20\",'Product benefit & adoption'!AM30*'Product benefit & adoption'!$L30/1000000)","v":0},{"$f":"_xlfn.IFS('Product benefit & adoption'!$G$4=\"ALL\",'Product benefit & adoption'!AN30*'Product benefit & adoption'!$P30/1000000,'Product benefit & adoption'!$G$4=\"2020-25\",'Product benefit & adoption'!AN30*'Product benefit & adoption'!$N30/1000000,'Product benefit & adoption'!$G$4=\"2015-20\",'Product benefit & adoption'!AN30*'Product benefit & adoption'!$L30/1000000)","v":0},{"$f":"_xlfn.IFS('Product benefit & adoption'!$G$4=\"ALL\",'Product benefit & adoption'!AO30*'Product benefit & adoption'!$P30/1000000,'Product benefit & adoption'!$G$4=\"2020-25\",'Product benefit & adoption'!AO30*'Product benefit & adoption'!$N30/1000000,'Product benefit & adoption'!$G$4=\"2015-20\",'Product benefit & adoption'!AO30*'Product benefit & adoption'!$L30/1000000)","v":0},{"$f":"_xlfn.IFS('Product benefit & adoption'!$G$4=\"ALL\",'Product benefit & adoption'!AP30*'Product benefit & adoption'!$P30/1000000,'Product benefit & adoption'!$G$4=\"2020-25\",'Product benefit & adoption'!AP30*'Product benefit & adoption'!$N30/1000000,'Product benefit & adoption'!$G$4=\"2015-20\",'Product benefit & adoption'!AP30*'Product benefit & adoption'!$L30/1000000)","v":0},{"$f":"_xlfn.IFS('Product benefit & adoption'!$G$4=\"ALL\",'Product benefit & adoption'!AQ30*'Product benefit & adoption'!$P30/1000000,'Product benefit & adoption'!$G$4=\"2020-25\",'Product benefit & adoption'!AQ30*'Product benefit & adoption'!$N30/1000000,'Product benefit & adoption'!$G$4=\"2015-20\",'Product benefit & adoption'!AQ30*'Product benefit & adoption'!$L30/1000000)","v":0},{"$f":"_xlfn.IFS('Product benefit & adoption'!$G$4=\"ALL\",'Product benefit & adoption'!AR30*'Product benefit & adoption'!$P30/1000000,'Product benefit & adoption'!$G$4=\"2020-25\",'Product benefit & adoption'!AR30*'Product benefit & adoption'!$N30/1000000,'Product benefit & adoption'!$G$4=\"2015-20\",'Product benefit & adoption'!AR30*'Product benefit & adoption'!$L30/1000000)","v":0},{"$f":"_xlfn.IFS('Product benefit & adoption'!$G$4=\"ALL\",'Product benefit & adoption'!AS30*'Product benefit & adoption'!$P30/1000000,'Product benefit & adoption'!$G$4=\"2020-25\",'Product benefit & adoption'!AS30*'Product benefit & adoption'!$N30/1000000,'Product benefit & adoption'!$G$4=\"2015-20\",'Product benefit & adoption'!AS30*'Product benefit & adoption'!$L30/1000000)","v":0},{"$f":"_xlfn.IFS('Product benefit & adoption'!$G$4=\"ALL\",'Product benefit & adoption'!AT30*'Product benefit & adoption'!$P30/1000000,'Product benefit & adoption'!$G$4=\"2020-25\",'Product benefit & adoption'!AT30*'Product benefit & adoption'!$N30/1000000,'Product benefit & adoption'!$G$4=\"2015-20\",'Product benefit & adoption'!AT30*'Product benefit & adoption'!$L30/1000000)","v":0},{"$f":"_xlfn.IFS('Product benefit & adoption'!$G$4=\"ALL\",'Product benefit & adoption'!AU30*'Product benefit & adoption'!$P30/1000000,'Product benefit & adoption'!$G$4=\"2020-25\",'Product benefit & adoption'!AU30*'Product benefit & adoption'!$N30/1000000,'Product benefit & adoption'!$G$4=\"2015-20\",'Product benefit & adoption'!AU30*'Product benefit & adoption'!$L30/1000000)","v":0},{"$f":"_xlfn.IFS('Product benefit & adoption'!$G$4=\"ALL\",'Product benefit & adoption'!AV30*'Product benefit & adoption'!$P30/1000000,'Product benefit & adoption'!$G$4=\"2020-25\",'Product benefit & adoption'!AV30*'Product benefit & adoption'!$N30/1000000,'Product benefit & adoption'!$G$4=\"2015-20\",'Product benefit & adoption'!AV30*'Product benefit & adoption'!$L30/1000000)","v":0},{"$f":"_xlfn.IFS('Product benefit & adoption'!$G$4=\"ALL\",'Product benefit & adoption'!AW30*'Product benefit & adoption'!$P30/1000000,'Product benefit & adoption'!$G$4=\"2020-25\",'Product benefit & adoption'!AW30*'Product benefit & adoption'!$N30/1000000,'Product benefit & adoption'!$G$4=\"2015-20\",'Product benefit & adoption'!AW30*'Product benefit & adoption'!$L30/1000000)","v":0},{"$f":"_xlfn.IFS('Product benefit & adoption'!$G$4=\"ALL\",'Product benefit & adoption'!AX30*'Product benefit & adoption'!$P30/1000000,'Product benefit & adoption'!$G$4=\"2020-25\",'Product benefit & adoption'!AX30*'Product benefit & adoption'!$N30/1000000,'Product benefit & adoption'!$G$4=\"2015-20\",'Product benefit & adoption'!AX30*'Product benefit & adoption'!$L30/1000000)","v":0},{"$f":"_xlfn.IFS('Product benefit & adoption'!$G$4=\"ALL\",'Product benefit & adoption'!AY30*'Product benefit & adoption'!$P30/1000000,'Product benefit & adoption'!$G$4=\"2020-25\",'Product benefit & adoption'!AY30*'Product benefit & adoption'!$N30/1000000,'Product benefit & adoption'!$G$4=\"2015-20\",'Product benefit & adoption'!AY30*'Product benefit & adoption'!$L30/1000000)","v":0},{"$f":"_xlfn.IFS('Product benefit & adoption'!$G$4=\"ALL\",'Product benefit & adoption'!AZ30*'Product benefit & adoption'!$P30/1000000,'Product benefit & adoption'!$G$4=\"2020-25\",'Product benefit & adoption'!AZ30*'Product benefit & adoption'!$N30/1000000,'Product benefit & adoption'!$G$4=\"2015-20\",'Product benefit & adoption'!AZ30*'Product benefit & adoption'!$L30/1000000)","v":0},{"$f":"_xlfn.IFS('Product benefit & adoption'!$G$4=\"ALL\",'Product benefit & adoption'!BA30*'Product benefit & adoption'!$P30/1000000,'Product benefit & adoption'!$G$4=\"2020-25\",'Product benefit & adoption'!BA30*'Product benefit & adoption'!$N30/1000000,'Product benefit & adoption'!$G$4=\"2015-20\",'Product benefit & adoption'!BA30*'Product benefit & adoption'!$L30/1000000)","v":0},{"$f":"_xlfn.IFS('Product benefit & adoption'!$G$4=\"ALL\",'Product benefit & adoption'!BB30*'Product benefit & adoption'!$P30/1000000,'Product benefit & adoption'!$G$4=\"2020-25\",'Product benefit & adoption'!BB30*'Product benefit & adoption'!$N30/1000000,'Product benefit & adoption'!$G$4=\"2015-20\",'Product benefit & adoption'!BB30*'Product benefit & adoption'!$L30/1000000)","v":0},{"$f":"_xlfn.IFS('Product benefit & adoption'!$G$4=\"ALL\",'Product benefit & adoption'!BC30*'Product benefit & adoption'!$P30/1000000,'Product benefit & adoption'!$G$4=\"2020-25\",'Product benefit & adoption'!BC30*'Product benefit & adoption'!$N30/1000000,'Product benefit & adoption'!$G$4=\"2015-20\",'Product benefit & adoption'!BC30*'Product benefit & adoption'!$L30/1000000)","v":0},{"$f":"_xlfn.IFS('Product benefit & adoption'!$G$4=\"ALL\",'Product benefit & adoption'!BD30*'Product benefit & adoption'!$P30/1000000,'Product benefit & adoption'!$G$4=\"2020-25\",'Product benefit & adoption'!BD30*'Product benefit & adoption'!$N30/1000000,'Product benefit & adoption'!$G$4=\"2015-20\",'Product benefit & adoption'!BD30*'Product benefit & adoption'!$L30/1000000)","v":0}]
[null,21,{"$f":"IF('Product benefit & adoption'!D31=\"\",\"\",'Product benefit & adoption'!D31)","v":""},{"$f":"IF('Product benefit & adoption'!F31=\"\",\"\",'Product benefit & adoption'!F31)","v":""},0,{"$f":"_xlfn.IFS('Product benefit & adoption'!$G$4=\"ALL\",'Product benefit & adoption'!AA31*'Product benefit & adoption'!$P31/1000000,'Product benefit & adoption'!$G$4=\"2020-25\",'Product benefit & adoption'!AA31*'Product benefit & adoption'!$N31/1000000,'Product benefit & adoption'!$G$4=\"2015-20\",'Product benefit & adoption'!AA31*'Product benefit & adoption'!$L31/1000000)","v":0},{"$f":"_xlfn.IFS('Product benefit & adoption'!$G$4=\"ALL\",'Product benefit & adoption'!AB31*'Product benefit & adoption'!$P31/1000000,'Product benefit & adoption'!$G$4=\"2020-25\",'Product benefit & adoption'!AB31*'Product benefit & adoption'!$N31/1000000,'Product benefit & adoption'!$G$4=\"2015-20\",'Product benefit & adoption'!AB31*'Product benefit & adoption'!$L31/1000000)","v":0},{"$f":"_xlfn.IFS('Product benefit & adoption'!$G$4=\"ALL\",'Product benefit & adoption'!AC31*'Product benefit & adoption'!$P31/1000000,'Product benefit & adoption'!$G$4=\"2020-25\",'Product benefit & adoption'!AC31*'Product benefit & adoption'!$N31/1000000,'Product benefit & adoption'!$G$4=\"2015-20\",'Product benefit & adoption'!AC31*'Product benefit & adoption'!$L31/1000000)","v":0},{"$f":"_xlfn.IFS('Product benefit & adoption'!$G$4=\"ALL\",'Product benefit & adoption'!AD31*'Product benefit & adoption'!$P31/1000000,'Product benefit & adoption'!$G$4=\"2020-25\",'Product benefit & adoption'!AD31*'Product benefit & adoption'!$N31/1000000,'Product benefit & adoption'!$G$4=\"2015-20\",'Product benefit & adoption'!AD31*'Product benefit & adoption'!$L31/1000000)","v":0},{"$f":"_xlfn.IFS('Product benefit & adoption'!$G$4=\"ALL\",'Product benefit & adoption'!AE31*'Product benefit & adoption'!$P31/1000000,'Product benefit & adoption'!$G$4=\"2020-25\",'Product benefit & adoption'!AE31*'Product benefit & adoption'!$N31/1000000,'Product benefit & adoption'!$G$4=\"2015-20\",'Product benefit & adoption'!AE31*'Product benefit & adoption'!$L31/1000000)","v":0},{"$f":"_xlfn.IFS('Product benefit & adoption'!$G$4=\"ALL\",'Product benefit & adoption'!AF31*'Product benefit & adoption'!$P31/1000000,'Product benefit & adoption'!$G$4=\"2020-25\",'Product benefit & adoption'!AF31*'Product benefit & adoption'!$N31/1000000,'Product benefit & adoption'!$G$4=\"2015-20\",'Product benefit & adoption'!AF31*'Product benefit & adoption'!$L31/1000000)","v":0},{"$f":"_xlfn.IFS('Product benefit & adoption'!$G$4=\"ALL\",'Product benefit & adoption'!AG31*'Product benefit & adoption'!$P31/1000000,'Product benefit & adoption'!$G$4=\"2020-25\",'Product benefit & adoption'!AG31*'Product benefit & adoption'!$N31/1000000,'Product benefit & adoption'!$G$4=\"2015-20\",'Product benefit & adoption'!AG31*'Product benefit & adoption'!$L31/1000000)","v":0},{"$f":"_xlfn.IFS('Product benefit & adoption'!$G$4=\"ALL\",'Product benefit & adoption'!AH31*'Product benefit & adoption'!$P31/1000000,'Product benefit & adoption'!$G$4=\"2020-25\",'Product benefit & adoption'!AH31*'Product benefit & adoption'!$N31/1000000,'Product benefit & adoption'!$G$4=\"2015-20\",'Product benefit & adoption'!AH31*'Product benefit & adoption'!$L31/1000000)","v":0},{"$f":"_xlfn.IFS('Product benefit & adoption'!$G$4=\"ALL\",'Product benefit & adoption'!AI31*'Product benefit & adoption'!$P31/1000000,'Product benefit & adoption'!$G$4=\"2020-25\",'Product benefit & adoption'!AI31*'Product benefit & adoption'!$N31/1000000,'Product benefit & adoption'!$G$4=\"2015-20\",'Product benefit & adoption'!AI31*'Product benefit & adoption'!$L31/1000000)","v":0},{"$f":"_xlfn.IFS('Product benefit & adoption'!$G$4=\"ALL\",'Product benefit & adoption'!AJ31*'Product benefit & adoption'!$P31/1000000,'Product benefit & adoption'!$G$4=\"2020-25\",'Product benefit & adoption'!AJ31*'Product benefit & adoption'!$N31/1000000,'Product benefit & adoption'!$G$4=\"2015-20\",'Product benefit & adoption'!AJ31*'Product benefit & adoption'!$L31/1000000)","v":0},{"$f":"_xlfn.IFS('Product benefit & adoption'!$G$4=\"ALL\",'Product benefit & adoption'!AK31*'Product benefit & adoption'!$P31/1000000,'Product benefit & adoption'!$G$4=\"2020-25\",'Product benefit & adoption'!AK31*'Product benefit & adoption'!$N31/1000000,'Product benefit & adoption'!$G$4=\"2015-20\",'Product benefit & adoption'!AK31*'Product benefit & adoption'!$L31/1000000)","v":0},{"$f":"_xlfn.IFS('Product benefit & adoption'!$G$4=\"ALL\",'Product benefit & adoption'!AL31*'Product benefit & adoption'!$P31/1000000,'Product benefit & adoption'!$G$4=\"2020-25\",'Product benefit & adoption'!AL31*'Product benefit & adoption'!$N31/1000000,'Product benefit & adoption'!$G$4=\"2015-20\",'Product benefit & adoption'!AL31*'Product benefit & adoption'!$L31/1000000)","v":0},{"$f":"_xlfn.IFS('Product benefit & adoption'!$G$4=\"ALL\",'Product benefit & adoption'!AM31*'Product benefit & adoption'!$P31/1000000,'Product benefit & adoption'!$G$4=\"2020-25\",'Product benefit & adoption'!AM31*'Product benefit & adoption'!$N31/1000000,'Product benefit & adoption'!$G$4=\"2015-20\",'Product benefit & adoption'!AM31*'Product benefit & adoption'!$L31/1000000)","v":0},{"$f":"_xlfn.IFS('Product benefit & adoption'!$G$4=\"ALL\",'Product benefit & adoption'!AN31*'Product benefit & adoption'!$P31/1000000,'Product benefit & adoption'!$G$4=\"2020-25\",'Product benefit & adoption'!AN31*'Product benefit & adoption'!$N31/1000000,'Product benefit & adoption'!$G$4=\"2015-20\",'Product benefit & adoption'!AN31*'Product benefit & adoption'!$L31/1000000)","v":0},{"$f":"_xlfn.IFS('Product benefit & adoption'!$G$4=\"ALL\",'Product benefit & adoption'!AO31*'Product benefit & adoption'!$P31/1000000,'Product benefit & adoption'!$G$4=\"2020-25\",'Product benefit & adoption'!AO31*'Product benefit & adoption'!$N31/1000000,'Product benefit & adoption'!$G$4=\"2015-20\",'Product benefit & adoption'!AO31*'Product benefit & adoption'!$L31/1000000)","v":0},{"$f":"_xlfn.IFS('Product benefit & adoption'!$G$4=\"ALL\",'Product benefit & adoption'!AP31*'Product benefit & adoption'!$P31/1000000,'Product benefit & adoption'!$G$4=\"2020-25\",'Product benefit & adoption'!AP31*'Product benefit & adoption'!$N31/1000000,'Product benefit & adoption'!$G$4=\"2015-20\",'Product benefit & adoption'!AP31*'Product benefit & adoption'!$L31/1000000)","v":0},{"$f":"_xlfn.IFS('Product benefit & adoption'!$G$4=\"ALL\",'Product benefit & adoption'!AQ31*'Product benefit & adoption'!$P31/1000000,'Product benefit & adoption'!$G$4=\"2020-25\",'Product benefit & adoption'!AQ31*'Product benefit & adoption'!$N31/1000000,'Product benefit & adoption'!$G$4=\"2015-20\",'Product benefit & adoption'!AQ31*'Product benefit & adoption'!$L31/1000000)","v":0},{"$f":"_xlfn.IFS('Product benefit & adoption'!$G$4=\"ALL\",'Product benefit & adoption'!AR31*'Product benefit & adoption'!$P31/1000000,'Product benefit & adoption'!$G$4=\"2020-25\",'Product benefit & adoption'!AR31*'Product benefit & adoption'!$N31/1000000,'Product benefit & adoption'!$G$4=\"2015-20\",'Product benefit & adoption'!AR31*'Product benefit & adoption'!$L31/1000000)","v":0},{"$f":"_xlfn.IFS('Product benefit & adoption'!$G$4=\"ALL\",'Product benefit & adoption'!AS31*'Product benefit & adoption'!$P31/1000000,'Product benefit & adoption'!$G$4=\"2020-25\",'Product benefit & adoption'!AS31*'Product benefit & adoption'!$N31/1000000,'Product benefit & adoption'!$G$4=\"2015-20\",'Product benefit & adoption'!AS31*'Product benefit & adoption'!$L31/1000000)","v":0},{"$f":"_xlfn.IFS('Product benefit & adoption'!$G$4=\"ALL\",'Product benefit & adoption'!AT31*'Product benefit & adoption'!$P31/1000000,'Product benefit & adoption'!$G$4=\"2020-25\",'Product benefit & adoption'!AT31*'Product benefit & adoption'!$N31/1000000,'Product benefit & adoption'!$G$4=\"2015-20\",'Product benefit & adoption'!AT31*'Product benefit & adoption'!$L31/1000000)","v":0},{"$f":"_xlfn.IFS('Product benefit & adoption'!$G$4=\"ALL\",'Product benefit & adoption'!AU31*'Product benefit & adoption'!$P31/1000000,'Product benefit & adoption'!$G$4=\"2020-25\",'Product benefit & adoption'!AU31*'Product benefit & adoption'!$N31/1000000,'Product benefit & adoption'!$G$4=\"2015-20\",'Product benefit & adoption'!AU31*'Product benefit & adoption'!$L31/1000000)","v":0},{"$f":"_xlfn.IFS('Product benefit & adoption'!$G$4=\"ALL\",'Product benefit & adoption'!AV31*'Product benefit & adoption'!$P31/1000000,'Product benefit & adoption'!$G$4=\"2020-25\",'Product benefit & adoption'!AV31*'Product benefit & adoption'!$N31/1000000,'Product benefit & adoption'!$G$4=\"2015-20\",'Product benefit & adoption'!AV31*'Product benefit & adoption'!$L31/1000000)","v":0},{"$f":"_xlfn.IFS('Product benefit & adoption'!$G$4=\"ALL\",'Product benefit & adoption'!AW31*'Product benefit & adoption'!$P31/1000000,'Product benefit & adoption'!$G$4=\"2020-25\",'Product benefit & adoption'!AW31*'Product benefit & adoption'!$N31/1000000,'Product benefit & adoption'!$G$4=\"2015-20\",'Product benefit & adoption'!AW31*'Product benefit & adoption'!$L31/1000000)","v":0},{"$f":"_xlfn.IFS('Product benefit & adoption'!$G$4=\"ALL\",'Product benefit & adoption'!AX31*'Product benefit & adoption'!$P31/1000000,'Product benefit & adoption'!$G$4=\"2020-25\",'Product benefit & adoption'!AX31*'Product benefit & adoption'!$N31/1000000,'Product benefit & adoption'!$G$4=\"2015-20\",'Product benefit & adoption'!AX31*'Product benefit & adoption'!$L31/1000000)","v":0},{"$f":"_xlfn.IFS('Product benefit & adoption'!$G$4=\"ALL\",'Product benefit & adoption'!AY31*'Product benefit & adoption'!$P31/1000000,'Product benefit & adoption'!$G$4=\"2020-25\",'Product benefit & adoption'!AY31*'Product benefit & adoption'!$N31/1000000,'Product benefit & adoption'!$G$4=\"2015-20\",'Product benefit & adoption'!AY31*'Product benefit & adoption'!$L31/1000000)","v":0},{"$f":"_xlfn.IFS('Product benefit & adoption'!$G$4=\"ALL\",'Product benefit & adoption'!AZ31*'Product benefit & adoption'!$P31/1000000,'Product benefit & adoption'!$G$4=\"2020-25\",'Product benefit & adoption'!AZ31*'Product benefit & adoption'!$N31/1000000,'Product benefit & adoption'!$G$4=\"2015-20\",'Product benefit & adoption'!AZ31*'Product benefit & adoption'!$L31/1000000)","v":0},{"$f":"_xlfn.IFS('Product benefit & adoption'!$G$4=\"ALL\",'Product benefit & adoption'!BA31*'Product benefit & adoption'!$P31/1000000,'Product benefit & adoption'!$G$4=\"2020-25\",'Product benefit & adoption'!BA31*'Product benefit & adoption'!$N31/1000000,'Product benefit & adoption'!$G$4=\"2015-20\",'Product benefit & adoption'!BA31*'Product benefit & adoption'!$L31/1000000)","v":0},{"$f":"_xlfn.IFS('Product benefit & adoption'!$G$4=\"ALL\",'Product benefit & adoption'!BB31*'Product benefit & adoption'!$P31/1000000,'Product benefit & adoption'!$G$4=\"2020-25\",'Product benefit & adoption'!BB31*'Product benefit & adoption'!$N31/1000000,'Product benefit & adoption'!$G$4=\"2015-20\",'Product benefit & adoption'!BB31*'Product benefit & adoption'!$L31/1000000)","v":0},{"$f":"_xlfn.IFS('Product benefit & adoption'!$G$4=\"ALL\",'Product benefit & adoption'!BC31*'Product benefit & adoption'!$P31/1000000,'Product benefit & adoption'!$G$4=\"2020-25\",'Product benefit & adoption'!BC31*'Product benefit & adoption'!$N31/1000000,'Product benefit & adoption'!$G$4=\"2015-20\",'Product benefit & adoption'!BC31*'Product benefit & adoption'!$L31/1000000)","v":0},{"$f":"_xlfn.IFS('Product benefit & adoption'!$G$4=\"ALL\",'Product benefit & adoption'!BD31*'Product benefit & adoption'!$P31/1000000,'Product benefit & adoption'!$G$4=\"2020-25\",'Product benefit & adoption'!BD31*'Product benefit & adoption'!$N31/1000000,'Product benefit & adoption'!$G$4=\"2015-20\",'Product benefit & adoption'!BD31*'Product benefit & adoption'!$L31/1000000)","v":0}]
[null,22,{"$f":"IF('Product benefit & adoption'!D32=\"\",\"\",'Product benefit & adoption'!D32)","v":""},{"$f":"IF('Product benefit & adoption'!F32=\"\",\"\",'Product benefit & adoption'!F32)","v":""},0,{"$f":"_xlfn.IFS('Product benefit & adoption'!$G$4=\"ALL\",'Product benefit & adoption'!AA32*'Product benefit & adoption'!$P32/1000000,'Product benefit & adoption'!$G$4=\"2020-25\",'Product benefit & adoption'!AA32*'Product benefit & adoption'!$N32/1000000,'Product benefit & adoption'!$G$4=\"2015-20\",'Product benefit & adoption'!AA32*'Product benefit & adoption'!$L32/1000000)","v":0},{"$f":"_xlfn.IFS('Product benefit & adoption'!$G$4=\"ALL\",'Product benefit & adoption'!AB32*'Product benefit & adoption'!$P32/1000000,'Product benefit & adoption'!$G$4=\"2020-25\",'Product benefit & adoption'!AB32*'Product benefit & adoption'!$N32/1000000,'Product benefit & adoption'!$G$4=\"2015-20\",'Product benefit & adoption'!AB32*'Product benefit & adoption'!$L32/1000000)","v":0},{"$f":"_xlfn.IFS('Product benefit & adoption'!$G$4=\"ALL\",'Product benefit & adoption'!AC32*'Product benefit & adoption'!$P32/1000000,'Product benefit & adoption'!$G$4=\"2020-25\",'Product benefit & adoption'!AC32*'Product benefit & adoption'!$N32/1000000,'Product benefit & adoption'!$G$4=\"2015-20\",'Product benefit & adoption'!AC32*'Product benefit & adoption'!$L32/1000000)","v":0},{"$f":"_xlfn.IFS('Product benefit & adoption'!$G$4=\"ALL\",'Product benefit & adoption'!AD32*'Product benefit & adoption'!$P32/1000000,'Product benefit & adoption'!$G$4=\"2020-25\",'Product benefit & adoption'!AD32*'Product benefit & adoption'!$N32/1000000,'Product benefit & adoption'!$G$4=\"2015-20\",'Product benefit & adoption'!AD32*'Product benefit & adoption'!$L32/1000000)","v":0},{"$f":"_xlfn.IFS('Product benefit & adoption'!$G$4=\"ALL\",'Product benefit & adoption'!AE32*'Product benefit & adoption'!$P32/1000000,'Product benefit & adoption'!$G$4=\"2020-25\",'Product benefit & adoption'!AE32*'Product benefit & adoption'!$N32/1000000,'Product benefit & adoption'!$G$4=\"2015-20\",'Product benefit & adoption'!AE32*'Product benefit & adoption'!$L32/1000000)","v":0},{"$f":"_xlfn.IFS('Product benefit & adoption'!$G$4=\"ALL\",'Product benefit & adoption'!AF32*'Product benefit & adoption'!$P32/1000000,'Product benefit & adoption'!$G$4=\"2020-25\",'Product benefit & adoption'!AF32*'Product benefit & adoption'!$N32/1000000,'Product benefit & adoption'!$G$4=\"2015-20\",'Product benefit & adoption'!AF32*'Product benefit & adoption'!$L32/1000000)","v":0},{"$f":"_xlfn.IFS('Product benefit & adoption'!$G$4=\"ALL\",'Product benefit & adoption'!AG32*'Product benefit & adoption'!$P32/1000000,'Product benefit & adoption'!$G$4=\"2020-25\",'Product benefit & adoption'!AG32*'Product benefit & adoption'!$N32/1000000,'Product benefit & adoption'!$G$4=\"2015-20\",'Product benefit & adoption'!AG32*'Product benefit & adoption'!$L32/1000000)","v":0},{"$f":"_xlfn.IFS('Product benefit & adoption'!$G$4=\"ALL\",'Product benefit & adoption'!AH32*'Product benefit & adoption'!$P32/1000000,'Product benefit & adoption'!$G$4=\"2020-25\",'Product benefit & adoption'!AH32*'Product benefit & adoption'!$N32/1000000,'Product benefit & adoption'!$G$4=\"2015-20\",'Product benefit & adoption'!AH32*'Product benefit & adoption'!$L32/1000000)","v":0},{"$f":"_xlfn.IFS('Product benefit & adoption'!$G$4=\"ALL\",'Product benefit & adoption'!AI32*'Product benefit & adoption'!$P32/1000000,'Product benefit & adoption'!$G$4=\"2020-25\",'Product benefit & adoption'!AI32*'Product benefit & adoption'!$N32/1000000,'Product benefit & adoption'!$G$4=\"2015-20\",'Product benefit & adoption'!AI32*'Product benefit & adoption'!$L32/1000000)","v":0},{"$f":"_xlfn.IFS('Product benefit & adoption'!$G$4=\"ALL\",'Product benefit & adoption'!AJ32*'Product benefit & adoption'!$P32/1000000,'Product benefit & adoption'!$G$4=\"2020-25\",'Product benefit & adoption'!AJ32*'Product benefit & adoption'!$N32/1000000,'Product benefit & adoption'!$G$4=\"2015-20\",'Product benefit & adoption'!AJ32*'Product benefit & adoption'!$L32/1000000)","v":0},{"$f":"_xlfn.IFS('Product benefit & adoption'!$G$4=\"ALL\",'Product benefit & adoption'!AK32*'Product benefit & adoption'!$P32/1000000,'Product benefit & adoption'!$G$4=\"2020-25\",'Product benefit & adoption'!AK32*'Product benefit & adoption'!$N32/1000000,'Product benefit & adoption'!$G$4=\"2015-20\",'Product benefit & adoption'!AK32*'Product benefit & adoption'!$L32/1000000)","v":0},{"$f":"_xlfn.IFS('Product benefit & adoption'!$G$4=\"ALL\",'Product benefit & adoption'!AL32*'Product benefit & adoption'!$P32/1000000,'Product benefit & adoption'!$G$4=\"2020-25\",'Product benefit & adoption'!AL32*'Product benefit & adoption'!$N32/1000000,'Product benefit & adoption'!$G$4=\"2015-20\",'Product benefit & adoption'!AL32*'Product benefit & adoption'!$L32/1000000)","v":0},{"$f":"_xlfn.IFS('Product benefit & adoption'!$G$4=\"ALL\",'Product benefit & adoption'!AM32*'Product benefit & adoption'!$P32/1000000,'Product benefit & adoption'!$G$4=\"2020-25\",'Product benefit & adoption'!AM32*'Product benefit & adoption'!$N32/1000000,'Product benefit & adoption'!$G$4=\"2015-20\",'Product benefit & adoption'!AM32*'Product benefit & adoption'!$L32/1000000)","v":0},{"$f":"_xlfn.IFS('Product benefit & adoption'!$G$4=\"ALL\",'Product benefit & adoption'!AN32*'Product benefit & adoption'!$P32/1000000,'Product benefit & adoption'!$G$4=\"2020-25\",'Product benefit & adoption'!AN32*'Product benefit & adoption'!$N32/1000000,'Product benefit & adoption'!$G$4=\"2015-20\",'Product benefit & adoption'!AN32*'Product benefit & adoption'!$L32/1000000)","v":0},{"$f":"_xlfn.IFS('Product benefit & adoption'!$G$4=\"ALL\",'Product benefit & adoption'!AO32*'Product benefit & adoption'!$P32/1000000,'Product benefit & adoption'!$G$4=\"2020-25\",'Product benefit & adoption'!AO32*'Product benefit & adoption'!$N32/1000000,'Product benefit & adoption'!$G$4=\"2015-20\",'Product benefit & adoption'!AO32*'Product benefit & adoption'!$L32/1000000)","v":0},{"$f":"_xlfn.IFS('Product benefit & adoption'!$G$4=\"ALL\",'Product benefit & adoption'!AP32*'Product benefit & adoption'!$P32/1000000,'Product benefit & adoption'!$G$4=\"2020-25\",'Product benefit & adoption'!AP32*'Product benefit & adoption'!$N32/1000000,'Product benefit & adoption'!$G$4=\"2015-20\",'Product benefit & adoption'!AP32*'Product benefit & adoption'!$L32/1000000)","v":0},{"$f":"_xlfn.IFS('Product benefit & adoption'!$G$4=\"ALL\",'Product benefit & adoption'!AQ32*'Product benefit & adoption'!$P32/1000000,'Product benefit & adoption'!$G$4=\"2020-25\",'Product benefit & adoption'!AQ32*'Product benefit & adoption'!$N32/1000000,'Product benefit & adoption'!$G$4=\"2015-20\",'Product benefit & adoption'!AQ32*'Product benefit & adoption'!$L32/1000000)","v":0},{"$f":"_xlfn.IFS('Product benefit & adoption'!$G$4=\"ALL\",'Product benefit & adoption'!AR32*'Product benefit & adoption'!$P32/1000000,'Product benefit & adoption'!$G$4=\"2020-25\",'Product benefit & adoption'!AR32*'Product benefit & adoption'!$N32/1000000,'Product benefit & adoption'!$G$4=\"2015-20\",'Product benefit & adoption'!AR32*'Product benefit & adoption'!$L32/1000000)","v":0},{"$f":"_xlfn.IFS('Product benefit & adoption'!$G$4=\"ALL\",'Product benefit & adoption'!AS32*'Product benefit & adoption'!$P32/1000000,'Product benefit & adoption'!$G$4=\"2020-25\",'Product benefit & adoption'!AS32*'Product benefit & adoption'!$N32/1000000,'Product benefit & adoption'!$G$4=\"2015-20\",'Product benefit & adoption'!AS32*'Product benefit & adoption'!$L32/1000000)","v":0},{"$f":"_xlfn.IFS('Product benefit & adoption'!$G$4=\"ALL\",'Product benefit & adoption'!AT32*'Product benefit & adoption'!$P32/1000000,'Product benefit & adoption'!$G$4=\"2020-25\",'Product benefit & adoption'!AT32*'Product benefit & adoption'!$N32/1000000,'Product benefit & adoption'!$G$4=\"2015-20\",'Product benefit & adoption'!AT32*'Product benefit & adoption'!$L32/1000000)","v":0},{"$f":"_xlfn.IFS('Product benefit & adoption'!$G$4=\"ALL\",'Product benefit & adoption'!AU32*'Product benefit & adoption'!$P32/1000000,'Product benefit & adoption'!$G$4=\"2020-25\",'Product benefit & adoption'!AU32*'Product benefit & adoption'!$N32/1000000,'Product benefit & adoption'!$G$4=\"2015-20\",'Product benefit & adoption'!AU32*'Product benefit & adoption'!$L32/1000000)","v":0},{"$f":"_xlfn.IFS('Product benefit & adoption'!$G$4=\"ALL\",'Product benefit & adoption'!AV32*'Product benefit & adoption'!$P32/1000000,'Product benefit & adoption'!$G$4=\"2020-25\",'Product benefit & adoption'!AV32*'Product benefit & adoption'!$N32/1000000,'Product benefit & adoption'!$G$4=\"2015-20\",'Product benefit & adoption'!AV32*'Product benefit & adoption'!$L32/1000000)","v":0},{"$f":"_xlfn.IFS('Product benefit & adoption'!$G$4=\"ALL\",'Product benefit & adoption'!AW32*'Product benefit & adoption'!$P32/1000000,'Product benefit & adoption'!$G$4=\"2020-25\",'Product benefit & adoption'!AW32*'Product benefit & adoption'!$N32/1000000,'Product benefit & adoption'!$G$4=\"2015-20\",'Product benefit & adoption'!AW32*'Product benefit & adoption'!$L32/1000000)","v":0},{"$f":"_xlfn.IFS('Product benefit & adoption'!$G$4=\"ALL\",'Product benefit & adoption'!AX32*'Product benefit & adoption'!$P32/1000000,'Product benefit & adoption'!$G$4=\"2020-25\",'Product benefit & adoption'!AX32*'Product benefit & adoption'!$N32/1000000,'Product benefit & adoption'!$G$4=\"2015-20\",'Product benefit & adoption'!AX32*'Product benefit & adoption'!$L32/1000000)","v":0},{"$f":"_xlfn.IFS('Product benefit & adoption'!$G$4=\"ALL\",'Product benefit & adoption'!AY32*'Product benefit & adoption'!$P32/1000000,'Product benefit & adoption'!$G$4=\"2020-25\",'Product benefit & adoption'!AY32*'Product benefit & adoption'!$N32/1000000,'Product benefit & adoption'!$G$4=\"2015-20\",'Product benefit & adoption'!AY32*'Product benefit & adoption'!$L32/1000000)","v":0},{"$f":"_xlfn.IFS('Product benefit & adoption'!$G$4=\"ALL\",'Product benefit & adoption'!AZ32*'Product benefit & adoption'!$P32/1000000,'Product benefit & adoption'!$G$4=\"2020-25\",'Product benefit & adoption'!AZ32*'Product benefit & adoption'!$N32/1000000,'Product benefit & adoption'!$G$4=\"2015-20\",'Product benefit & adoption'!AZ32*'Product benefit & adoption'!$L32/1000000)","v":0},{"$f":"_xlfn.IFS('Product benefit & adoption'!$G$4=\"ALL\",'Product benefit & adoption'!BA32*'Product benefit & adoption'!$P32/1000000,'Product benefit & adoption'!$G$4=\"2020-25\",'Product benefit & adoption'!BA32*'Product benefit & adoption'!$N32/1000000,'Product benefit & adoption'!$G$4=\"2015-20\",'Product benefit & adoption'!BA32*'Product benefit & adoption'!$L32/1000000)","v":0},{"$f":"_xlfn.IFS('Product benefit & adoption'!$G$4=\"ALL\",'Product benefit & adoption'!BB32*'Product benefit & adoption'!$P32/1000000,'Product benefit & adoption'!$G$4=\"2020-25\",'Product benefit & adoption'!BB32*'Product benefit & adoption'!$N32/1000000,'Product benefit & adoption'!$G$4=\"2015-20\",'Product benefit & adoption'!BB32*'Product benefit & adoption'!$L32/1000000)","v":0},{"$f":"_xlfn.IFS('Product benefit & adoption'!$G$4=\"ALL\",'Product benefit & adoption'!BC32*'Product benefit & adoption'!$P32/1000000,'Product benefit & adoption'!$G$4=\"2020-25\",'Product benefit & adoption'!BC32*'Product benefit & adoption'!$N32/1000000,'Product benefit & adoption'!$G$4=\"2015-20\",'Product benefit & adoption'!BC32*'Product benefit & adoption'!$L32/1000000)","v":0},{"$f":"_xlfn.IFS('Product benefit & adoption'!$G$4=\"ALL\",'Product benefit & adoption'!BD32*'Product benefit & adoption'!$P32/1000000,'Product benefit & adoption'!$G$4=\"2020-25\",'Product benefit & adoption'!BD32*'Product benefit & adoption'!$N32/1000000,'Product benefit & adoption'!$G$4=\"2015-20\",'Product benefit & adoption'!BD32*'Product benefit & adoption'!$L32/1000000)","v":0}]
[null,23,{"$f":"IF('Product benefit & adoption'!D33=\"\",\"\",'Product benefit & adoption'!D33)","v":""},{"$f":"IF('Product benefit & adoption'!F33=\"\",\"\",'Product benefit & adoption'!F33)","v":""},0,{"$f":"_xlfn.IFS('Product benefit & adoption'!$G$4=\"ALL\",'Product benefit & adoption'!AA33*'Product benefit & adoption'!$P33/1000000,'Product benefit & adoption'!$G$4=\"2020-25\",'Product benefit & adoption'!AA33*'Product benefit & adoption'!$N33/1000000,'Product benefit & adoption'!$G$4=\"2015-20\",'Product benefit & adoption'!AA33*'Product benefit & adoption'!$L33/1000000)","v":0},{"$f":"_xlfn.IFS('Product benefit & adoption'!$G$4=\"ALL\",'Product benefit & adoption'!AB33*'Product benefit & adoption'!$P33/1000000,'Product benefit & adoption'!$G$4=\"2020-25\",'Product benefit & adoption'!AB33*'Product benefit & adoption'!$N33/1000000,'Product benefit & adoption'!$G$4=\"2015-20\",'Product benefit & adoption'!AB33*'Product benefit & adoption'!$L33/1000000)","v":0},{"$f":"_xlfn.IFS('Product benefit & adoption'!$G$4=\"ALL\",'Product benefit & adoption'!AC33*'Product benefit & adoption'!$P33/1000000,'Product benefit & adoption'!$G$4=\"2020-25\",'Product benefit & adoption'!AC33*'Product benefit & adoption'!$N33/1000000,'Product benefit & adoption'!$G$4=\"2015-20\",'Product benefit & adoption'!AC33*'Product benefit & adoption'!$L33/1000000)","v":0},{"$f":"_xlfn.IFS('Product benefit & adoption'!$G$4=\"ALL\",'Product benefit & adoption'!AD33*'Product benefit & adoption'!$P33/1000000,'Product benefit & adoption'!$G$4=\"2020-25\",'Product benefit & adoption'!AD33*'Product benefit & adoption'!$N33/1000000,'Product benefit & adoption'!$G$4=\"2015-20\",'Product benefit & adoption'!AD33*'Product benefit & adoption'!$L33/1000000)","v":0},{"$f":"_xlfn.IFS('Product benefit & adoption'!$G$4=\"ALL\",'Product benefit & adoption'!AE33*'Product benefit & adoption'!$P33/1000000,'Product benefit & adoption'!$G$4=\"2020-25\",'Product benefit & adoption'!AE33*'Product benefit & adoption'!$N33/1000000,'Product benefit & adoption'!$G$4=\"2015-20\",'Product benefit & adoption'!AE33*'Product benefit & adoption'!$L33/1000000)","v":0},{"$f":"_xlfn.IFS('Product benefit & adoption'!$G$4=\"ALL\",'Product benefit & adoption'!AF33*'Product benefit & adoption'!$P33/1000000,'Product benefit & adoption'!$G$4=\"2020-25\",'Product benefit & adoption'!AF33*'Product benefit & adoption'!$N33/1000000,'Product benefit & adoption'!$G$4=\"2015-20\",'Product benefit & adoption'!AF33*'Product benefit & adoption'!$L33/1000000)","v":0},{"$f":"_xlfn.IFS('Product benefit & adoption'!$G$4=\"ALL\",'Product benefit & adoption'!AG33*'Product benefit & adoption'!$P33/1000000,'Product benefit & adoption'!$G$4=\"2020-25\",'Product benefit & adoption'!AG33*'Product benefit & adoption'!$N33/1000000,'Product benefit & adoption'!$G$4=\"2015-20\",'Product benefit & adoption'!AG33*'Product benefit & adoption'!$L33/1000000)","v":0},{"$f":"_xlfn.IFS('Product benefit & adoption'!$G$4=\"ALL\",'Product benefit & adoption'!AH33*'Product benefit & adoption'!$P33/1000000,'Product benefit & adoption'!$G$4=\"2020-25\",'Product benefit & adoption'!AH33*'Product benefit & adoption'!$N33/1000000,'Product benefit & adoption'!$G$4=\"2015-20\",'Product benefit & adoption'!AH33*'Product benefit & adoption'!$L33/1000000)","v":0},{"$f":"_xlfn.IFS('Product benefit & adoption'!$G$4=\"ALL\",'Product benefit & adoption'!AI33*'Product benefit & adoption'!$P33/1000000,'Product benefit & adoption'!$G$4=\"2020-25\",'Product benefit & adoption'!AI33*'Product benefit & adoption'!$N33/1000000,'Product benefit & adoption'!$G$4=\"2015-20\",'Product benefit & adoption'!AI33*'Product benefit & adoption'!$L33/1000000)","v":0},{"$f":"_xlfn.IFS('Product benefit & adoption'!$G$4=\"ALL\",'Product benefit & adoption'!AJ33*'Product benefit & adoption'!$P33/1000000,'Product benefit & adoption'!$G$4=\"2020-25\",'Product benefit & adoption'!AJ33*'Product benefit & adoption'!$N33/1000000,'Product benefit & adoption'!$G$4=\"2015-20\",'Product benefit & adoption'!AJ33*'Product benefit & adoption'!$L33/1000000)","v":0},{"$f":"_xlfn.IFS('Product benefit & adoption'!$G$4=\"ALL\",'Product benefit & adoption'!AK33*'Product benefit & adoption'!$P33/1000000,'Product benefit & adoption'!$G$4=\"2020-25\",'Product benefit & adoption'!AK33*'Product benefit & adoption'!$N33/1000000,'Product benefit & adoption'!$G$4=\"2015-20\",'Product benefit & adoption'!AK33*'Product benefit & adoption'!$L33/1000000)","v":0},{"$f":"_xlfn.IFS('Product benefit & adoption'!$G$4=\"ALL\",'Product benefit & adoption'!AL33*'Product benefit & adoption'!$P33/1000000,'Product benefit & adoption'!$G$4=\"2020-25\",'Product benefit & adoption'!AL33*'Product benefit & adoption'!$N33/1000000,'Product benefit & adoption'!$G$4=\"2015-20\",'Product benefit & adoption'!AL33*'Product benefit & adoption'!$L33/1000000)","v":0},{"$f":"_xlfn.IFS('Product benefit & adoption'!$G$4=\"ALL\",'Product benefit & adoption'!AM33*'Product benefit & adoption'!$P33/1000000,'Product benefit & adoption'!$G$4=\"2020-25\",'Product benefit & adoption'!AM33*'Product benefit & adoption'!$N33/1000000,'Product benefit & adoption'!$G$4=\"2015-20\",'Product benefit & adoption'!AM33*'Product benefit & adoption'!$L33/1000000)","v":0},{"$f":"_xlfn.IFS('Product benefit & adoption'!$G$4=\"ALL\",'Product benefit & adoption'!AN33*'Product benefit & adoption'!$P33/1000000,'Product benefit & adoption'!$G$4=\"2020-25\",'Product benefit & adoption'!AN33*'Product benefit & adoption'!$N33/1000000,'Product benefit & adoption'!$G$4=\"2015-20\",'Product benefit & adoption'!AN33*'Product benefit & adoption'!$L33/1000000)","v":0},{"$f":"_xlfn.IFS('Product benefit & adoption'!$G$4=\"ALL\",'Product benefit & adoption'!AO33*'Product benefit & adoption'!$P33/1000000,'Product benefit & adoption'!$G$4=\"2020-25\",'Product benefit & adoption'!AO33*'Product benefit & adoption'!$N33/1000000,'Product benefit & adoption'!$G$4=\"2015-20\",'Product benefit & adoption'!AO33*'Product benefit & adoption'!$L33/1000000)","v":0},{"$f":"_xlfn.IFS('Product benefit & adoption'!$G$4=\"ALL\",'Product benefit & adoption'!AP33*'Product benefit & adoption'!$P33/1000000,'Product benefit & adoption'!$G$4=\"2020-25\",'Product benefit & adoption'!AP33*'Product benefit & adoption'!$N33/1000000,'Product benefit & adoption'!$G$4=\"2015-20\",'Product benefit & adoption'!AP33*'Product benefit & adoption'!$L33/1000000)","v":0},{"$f":"_xlfn.IFS('Product benefit & adoption'!$G$4=\"ALL\",'Product benefit & adoption'!AQ33*'Product benefit & adoption'!$P33/1000000,'Product benefit & adoption'!$G$4=\"2020-25\",'Product benefit & adoption'!AQ33*'Product benefit & adoption'!$N33/1000000,'Product benefit & adoption'!$G$4=\"2015-20\",'Product benefit & adoption'!AQ33*'Product benefit & adoption'!$L33/1000000)","v":0},{"$f":"_xlfn.IFS('Product benefit & adoption'!$G$4=\"ALL\",'Product benefit & adoption'!AR33*'Product benefit & adoption'!$P33/1000000,'Product benefit & adoption'!$G$4=\"2020-25\",'Product benefit & adoption'!AR33*'Product benefit & adoption'!$N33/1000000,'Product benefit & adoption'!$G$4=\"2015-20\",'Product benefit & adoption'!AR33*'Product benefit & adoption'!$L33/1000000)","v":0},{"$f":"_xlfn.IFS('Product benefit & adoption'!$G$4=\"ALL\",'Product benefit & adoption'!AS33*'Product benefit & adoption'!$P33/1000000,'Product benefit & adoption'!$G$4=\"2020-25\",'Product benefit & adoption'!AS33*'Product benefit & adoption'!$N33/1000000,'Product benefit & adoption'!$G$4=\"2015-20\",'Product benefit & adoption'!AS33*'Product benefit & adoption'!$L33/1000000)","v":0},{"$f":"_xlfn.IFS('Product benefit & adoption'!$G$4=\"ALL\",'Product benefit & adoption'!AT33*'Product benefit & adoption'!$P33/1000000,'Product benefit & adoption'!$G$4=\"2020-25\",'Product benefit & adoption'!AT33*'Product benefit & adoption'!$N33/1000000,'Product benefit & adoption'!$G$4=\"2015-20\",'Product benefit & adoption'!AT33*'Product benefit & adoption'!$L33/1000000)","v":0},{"$f":"_xlfn.IFS('Product benefit & adoption'!$G$4=\"ALL\",'Product benefit & adoption'!AU33*'Product benefit & adoption'!$P33/1000000,'Product benefit & adoption'!$G$4=\"2020-25\",'Product benefit & adoption'!AU33*'Product benefit & adoption'!$N33/1000000,'Product benefit & adoption'!$G$4=\"2015-20\",'Product benefit & adoption'!AU33*'Product benefit & adoption'!$L33/1000000)","v":0},{"$f":"_xlfn.IFS('Product benefit & adoption'!$G$4=\"ALL\",'Product benefit & adoption'!AV33*'Product benefit & adoption'!$P33/1000000,'Product benefit & adoption'!$G$4=\"2020-25\",'Product benefit & adoption'!AV33*'Product benefit & adoption'!$N33/1000000,'Product benefit & adoption'!$G$4=\"2015-20\",'Product benefit & adoption'!AV33*'Product benefit & adoption'!$L33/1000000)","v":0},{"$f":"_xlfn.IFS('Product benefit & adoption'!$G$4=\"ALL\",'Product benefit & adoption'!AW33*'Product benefit & adoption'!$P33/1000000,'Product benefit & adoption'!$G$4=\"2020-25\",'Product benefit & adoption'!AW33*'Product benefit & adoption'!$N33/1000000,'Product benefit & adoption'!$G$4=\"2015-20\",'Product benefit & adoption'!AW33*'Product benefit & adoption'!$L33/1000000)","v":0},{"$f":"_xlfn.IFS('Product benefit & adoption'!$G$4=\"ALL\",'Product benefit & adoption'!AX33*'Product benefit & adoption'!$P33/1000000,'Product benefit & adoption'!$G$4=\"2020-25\",'Product benefit & adoption'!AX33*'Product benefit & adoption'!$N33/1000000,'Product benefit & adoption'!$G$4=\"2015-20\",'Product benefit & adoption'!AX33*'Product benefit & adoption'!$L33/1000000)","v":0},{"$f":"_xlfn.IFS('Product benefit & adoption'!$G$4=\"ALL\",'Product benefit & adoption'!AY33*'Product benefit & adoption'!$P33/1000000,'Product benefit & adoption'!$G$4=\"2020-25\",'Product benefit & adoption'!AY33*'Product benefit & adoption'!$N33/1000000,'Product benefit & adoption'!$G$4=\"2015-20\",'Product benefit & adoption'!AY33*'Product benefit & adoption'!$L33/1000000)","v":0},{"$f":"_xlfn.IFS('Product benefit & adoption'!$G$4=\"ALL\",'Product benefit & adoption'!AZ33*'Product benefit & adoption'!$P33/1000000,'Product benefit & adoption'!$G$4=\"2020-25\",'Product benefit & adoption'!AZ33*'Product benefit & adoption'!$N33/1000000,'Product benefit & adoption'!$G$4=\"2015-20\",'Product benefit & adoption'!AZ33*'Product benefit & adoption'!$L33/1000000)","v":0},{"$f":"_xlfn.IFS('Product benefit & adoption'!$G$4=\"ALL\",'Product benefit & adoption'!BA33*'Product benefit & adoption'!$P33/1000000,'Product benefit & adoption'!$G$4=\"2020-25\",'Product benefit & adoption'!BA33*'Product benefit & adoption'!$N33/1000000,'Product benefit & adoption'!$G$4=\"2015-20\",'Product benefit & adoption'!BA33*'Product benefit & adoption'!$L33/1000000)","v":0},{"$f":"_xlfn.IFS('Product benefit & adoption'!$G$4=\"ALL\",'Product benefit & adoption'!BB33*'Product benefit & adoption'!$P33/1000000,'Product benefit & adoption'!$G$4=\"2020-25\",'Product benefit & adoption'!BB33*'Product benefit & adoption'!$N33/1000000,'Product benefit & adoption'!$G$4=\"2015-20\",'Product benefit & adoption'!BB33*'Product benefit & adoption'!$L33/1000000)","v":0},{"$f":"_xlfn.IFS('Product benefit & adoption'!$G$4=\"ALL\",'Product benefit & adoption'!BC33*'Product benefit & adoption'!$P33/1000000,'Product benefit & adoption'!$G$4=\"2020-25\",'Product benefit & adoption'!BC33*'Product benefit & adoption'!$N33/1000000,'Product benefit & adoption'!$G$4=\"2015-20\",'Product benefit & adoption'!BC33*'Product benefit & adoption'!$L33/1000000)","v":0},{"$f":"_xlfn.IFS('Product benefit & adoption'!$G$4=\"ALL\",'Product benefit & adoption'!BD33*'Product benefit & adoption'!$P33/1000000,'Product benefit & adoption'!$G$4=\"2020-25\",'Product benefit & adoption'!BD33*'Product benefit & adoption'!$N33/1000000,'Product benefit & adoption'!$G$4=\"2015-20\",'Product benefit & adoption'!BD33*'Product benefit & adoption'!$L33/1000000)","v":0}]
[null,24,{"$f":"IF('Product benefit & adoption'!D34=\"\",\"\",'Product benefit & adoption'!D34)","v":""},{"$f":"IF('Product benefit & adoption'!F34=\"\",\"\",'Product benefit & adoption'!F34)","v":""},0,{"$f":"_xlfn.IFS('Product benefit & adoption'!$G$4=\"ALL\",'Product benefit & adoption'!AA34*'Product benefit & adoption'!$P34/1000000,'Product benefit & adoption'!$G$4=\"2020-25\",'Product benefit & adoption'!AA34*'Product benefit & adoption'!$N34/1000000,'Product benefit & adoption'!$G$4=\"2015-20\",'Product benefit & adoption'!AA34*'Product benefit & adoption'!$L34/1000000)","v":0},{"$f":"_xlfn.IFS('Product benefit & adoption'!$G$4=\"ALL\",'Product benefit & adoption'!AB34*'Product benefit & adoption'!$P34/1000000,'Product benefit & adoption'!$G$4=\"2020-25\",'Product benefit & adoption'!AB34*'Product benefit & adoption'!$N34/1000000,'Product benefit & adoption'!$G$4=\"2015-20\",'Product benefit & adoption'!AB34*'Product benefit & adoption'!$L34/1000000)","v":0},{"$f":"_xlfn.IFS('Product benefit & adoption'!$G$4=\"ALL\",'Product benefit & adoption'!AC34*'Product benefit & adoption'!$P34/1000000,'Product benefit & adoption'!$G$4=\"2020-25\",'Product benefit & adoption'!AC34*'Product benefit & adoption'!$N34/1000000,'Product benefit & adoption'!$G$4=\"2015-20\",'Product benefit & adoption'!AC34*'Product benefit & adoption'!$L34/1000000)","v":0},{"$f":"_xlfn.IFS('Product benefit & adoption'!$G$4=\"ALL\",'Product benefit & adoption'!AD34*'Product benefit & adoption'!$P34/1000000,'Product benefit & adoption'!$G$4=\"2020-25\",'Product benefit & adoption'!AD34*'Product benefit & adoption'!$N34/1000000,'Product benefit & adoption'!$G$4=\"2015-20\",'Product benefit & adoption'!AD34*'Product benefit & adoption'!$L34/1000000)","v":0},{"$f":"_xlfn.IFS('Product benefit & adoption'!$G$4=\"ALL\",'Product benefit & adoption'!AE34*'Product benefit & adoption'!$P34/1000000,'Product benefit & adoption'!$G$4=\"2020-25\",'Product benefit & adoption'!AE34*'Product benefit & adoption'!$N34/1000000,'Product benefit & adoption'!$G$4=\"2015-20\",'Product benefit & adoption'!AE34*'Product benefit & adoption'!$L34/1000000)","v":0},{"$f":"_xlfn.IFS('Product benefit & adoption'!$G$4=\"ALL\",'Product benefit & adoption'!AF34*'Product benefit & adoption'!$P34/1000000,'Product benefit & adoption'!$G$4=\"2020-25\",'Product benefit & adoption'!AF34*'Product benefit & adoption'!$N34/1000000,'Product benefit & adoption'!$G$4=\"2015-20\",'Product benefit & adoption'!AF34*'Product benefit & adoption'!$L34/1000000)","v":0},{"$f":"_xlfn.IFS('Product benefit & adoption'!$G$4=\"ALL\",'Product benefit & adoption'!AG34*'Product benefit & adoption'!$P34/1000000,'Product benefit & adoption'!$G$4=\"2020-25\",'Product benefit & adoption'!AG34*'Product benefit & adoption'!$N34/1000000,'Product benefit & adoption'!$G$4=\"2015-20\",'Product benefit & adoption'!AG34*'Product benefit & adoption'!$L34/1000000)","v":0},{"$f":"_xlfn.IFS('Product benefit & adoption'!$G$4=\"ALL\",'Product benefit & adoption'!AH34*'Product benefit & adoption'!$P34/1000000,'Product benefit & adoption'!$G$4=\"2020-25\",'Product benefit & adoption'!AH34*'Product benefit & adoption'!$N34/1000000,'Product benefit & adoption'!$G$4=\"2015-20\",'Product benefit & adoption'!AH34*'Product benefit & adoption'!$L34/1000000)","v":0},{"$f":"_xlfn.IFS('Product benefit & adoption'!$G$4=\"ALL\",'Product benefit & adoption'!AI34*'Product benefit & adoption'!$P34/1000000,'Product benefit & adoption'!$G$4=\"2020-25\",'Product benefit & adoption'!AI34*'Product benefit & adoption'!$N34/1000000,'Product benefit & adoption'!$G$4=\"2015-20\",'Product benefit & adoption'!AI34*'Product benefit & adoption'!$L34/1000000)","v":0},{"$f":"_xlfn.IFS('Product benefit & adoption'!$G$4=\"ALL\",'Product benefit & adoption'!AJ34*'Product benefit & adoption'!$P34/1000000,'Product benefit & adoption'!$G$4=\"2020-25\",'Product benefit & adoption'!AJ34*'Product benefit & adoption'!$N34/1000000,'Product benefit & adoption'!$G$4=\"2015-20\",'Product benefit & adoption'!AJ34*'Product benefit & adoption'!$L34/1000000)","v":0},{"$f":"_xlfn.IFS('Product benefit & adoption'!$G$4=\"ALL\",'Product benefit & adoption'!AK34*'Product benefit & adoption'!$P34/1000000,'Product benefit & adoption'!$G$4=\"2020-25\",'Product benefit & adoption'!AK34*'Product benefit & adoption'!$N34/1000000,'Product benefit & adoption'!$G$4=\"2015-20\",'Product benefit & adoption'!AK34*'Product benefit & adoption'!$L34/1000000)","v":0},{"$f":"_xlfn.IFS('Product benefit & adoption'!$G$4=\"ALL\",'Product benefit & adoption'!AL34*'Product benefit & adoption'!$P34/1000000,'Product benefit & adoption'!$G$4=\"2020-25\",'Product benefit & adoption'!AL34*'Product benefit & adoption'!$N34/1000000,'Product benefit & adoption'!$G$4=\"2015-20\",'Product benefit & adoption'!AL34*'Product benefit & adoption'!$L34/1000000)","v":0},{"$f":"_xlfn.IFS('Product benefit & adoption'!$G$4=\"ALL\",'Product benefit & adoption'!AM34*'Product benefit & adoption'!$P34/1000000,'Product benefit & adoption'!$G$4=\"2020-25\",'Product benefit & adoption'!AM34*'Product benefit & adoption'!$N34/1000000,'Product benefit & adoption'!$G$4=\"2015-20\",'Product benefit & adoption'!AM34*'Product benefit & adoption'!$L34/1000000)","v":0},{"$f":"_xlfn.IFS('Product benefit & adoption'!$G$4=\"ALL\",'Product benefit & adoption'!AN34*'Product benefit & adoption'!$P34/1000000,'Product benefit & adoption'!$G$4=\"2020-25\",'Product benefit & adoption'!AN34*'Product benefit & adoption'!$N34/1000000,'Product benefit & adoption'!$G$4=\"2015-20\",'Product benefit & adoption'!AN34*'Product benefit & adoption'!$L34/1000000)","v":0},{"$f":"_xlfn.IFS('Product benefit & adoption'!$G$4=\"ALL\",'Product benefit & adoption'!AO34*'Product benefit & adoption'!$P34/1000000,'Product benefit & adoption'!$G$4=\"2020-25\",'Product benefit & adoption'!AO34*'Product benefit & adoption'!$N34/1000000,'Product benefit & adoption'!$G$4=\"2015-20\",'Product benefit & adoption'!AO34*'Product benefit & adoption'!$L34/1000000)","v":0},{"$f":"_xlfn.IFS('Product benefit & adoption'!$G$4=\"ALL\",'Product benefit & adoption'!AP34*'Product benefit & adoption'!$P34/1000000,'Product benefit & adoption'!$G$4=\"2020-25\",'Product benefit & adoption'!AP34*'Product benefit & adoption'!$N34/1000000,'Product benefit & adoption'!$G$4=\"2015-20\",'Product benefit & adoption'!AP34*'Product benefit & adoption'!$L34/1000000)","v":0},{"$f":"_xlfn.IFS('Product benefit & adoption'!$G$4=\"ALL\",'Product benefit & adoption'!AQ34*'Product benefit & adoption'!$P34/1000000,'Product benefit & adoption'!$G$4=\"2020-25\",'Product benefit & adoption'!AQ34*'Product benefit & adoption'!$N34/1000000,'Product benefit & adoption'!$G$4=\"2015-20\",'Product benefit & adoption'!AQ34*'Product benefit & adoption'!$L34/1000000)","v":0},{"$f":"_xlfn.IFS('Product benefit & adoption'!$G$4=\"ALL\",'Product benefit & adoption'!AR34*'Product benefit & adoption'!$P34/1000000,'Product benefit & adoption'!$G$4=\"2020-25\",'Product benefit & adoption'!AR34*'Product benefit & adoption'!$N34/1000000,'Product benefit & adoption'!$G$4=\"2015-20\",'Product benefit & adoption'!AR34*'Product benefit & adoption'!$L34/1000000)","v":0},{"$f":"_xlfn.IFS('Product benefit & adoption'!$G$4=\"ALL\",'Product benefit & adoption'!AS34*'Product benefit & adoption'!$P34/1000000,'Product benefit & adoption'!$G$4=\"2020-25\",'Product benefit & adoption'!AS34*'Product benefit & adoption'!$N34/1000000,'Product benefit & adoption'!$G$4=\"2015-20\",'Product benefit & adoption'!AS34*'Product benefit & adoption'!$L34/1000000)","v":0},{"$f":"_xlfn.IFS('Product benefit & adoption'!$G$4=\"ALL\",'Product benefit & adoption'!AT34*'Product benefit & adoption'!$P34/1000000,'Product benefit & adoption'!$G$4=\"2020-25\",'Product benefit & adoption'!AT34*'Product benefit & adoption'!$N34/1000000,'Product benefit & adoption'!$G$4=\"2015-20\",'Product benefit & adoption'!AT34*'Product benefit & adoption'!$L34/1000000)","v":0},{"$f":"_xlfn.IFS('Product benefit & adoption'!$G$4=\"ALL\",'Product benefit & adoption'!AU34*'Product benefit & adoption'!$P34/1000000,'Product benefit & adoption'!$G$4=\"2020-25\",'Product benefit & adoption'!AU34*'Product benefit & adoption'!$N34/1000000,'Product benefit & adoption'!$G$4=\"2015-20\",'Product benefit & adoption'!AU34*'Product benefit & adoption'!$L34/1000000)","v":0},{"$f":"_xlfn.IFS('Product benefit & adoption'!$G$4=\"ALL\",'Product benefit & adoption'!AV34*'Product benefit & adoption'!$P34/1000000,'Product benefit & adoption'!$G$4=\"2020-25\",'Product benefit & adoption'!AV34*'Product benefit & adoption'!$N34/1000000,'Product benefit & adoption'!$G$4=\"2015-20\",'Product benefit & adoption'!AV34*'Product benefit & adoption'!$L34/1000000)","v":0},{"$f":"_xlfn.IFS('Product benefit & adoption'!$G$4=\"ALL\",'Product benefit & adoption'!AW34*'Product benefit & adoption'!$P34/1000000,'Product benefit & adoption'!$G$4=\"2020-25\",'Product benefit & adoption'!AW34*'Product benefit & adoption'!$N34/1000000,'Product benefit & adoption'!$G$4=\"2015-20\",'Product benefit & adoption'!AW34*'Product benefit & adoption'!$L34/1000000)","v":0},{"$f":"_xlfn.IFS('Product benefit & adoption'!$G$4=\"ALL\",'Product benefit & adoption'!AX34*'Product benefit & adoption'!$P34/1000000,'Product benefit & adoption'!$G$4=\"2020-25\",'Product benefit & adoption'!AX34*'Product benefit & adoption'!$N34/1000000,'Product benefit & adoption'!$G$4=\"2015-20\",'Product benefit & adoption'!AX34*'Product benefit & adoption'!$L34/1000000)","v":0},{"$f":"_xlfn.IFS('Product benefit & adoption'!$G$4=\"ALL\",'Product benefit & adoption'!AY34*'Product benefit & adoption'!$P34/1000000,'Product benefit & adoption'!$G$4=\"2020-25\",'Product benefit & adoption'!AY34*'Product benefit & adoption'!$N34/1000000,'Product benefit & adoption'!$G$4=\"2015-20\",'Product benefit & adoption'!AY34*'Product benefit & adoption'!$L34/1000000)","v":0},{"$f":"_xlfn.IFS('Product benefit & adoption'!$G$4=\"ALL\",'Product benefit & adoption'!AZ34*'Product benefit & adoption'!$P34/1000000,'Product benefit & adoption'!$G$4=\"2020-25\",'Product benefit & adoption'!AZ34*'Product benefit & adoption'!$N34/1000000,'Product benefit & adoption'!$G$4=\"2015-20\",'Product benefit & adoption'!AZ34*'Product benefit & adoption'!$L34/1000000)","v":0},{"$f":"_xlfn.IFS('Product benefit & adoption'!$G$4=\"ALL\",'Product benefit & adoption'!BA34*'Product benefit & adoption'!$P34/1000000,'Product benefit & adoption'!$G$4=\"2020-25\",'Product benefit & adoption'!BA34*'Product benefit & adoption'!$N34/1000000,'Product benefit & adoption'!$G$4=\"2015-20\",'Product benefit & adoption'!BA34*'Product benefit & adoption'!$L34/1000000)","v":0},{"$f":"_xlfn.IFS('Product benefit & adoption'!$G$4=\"ALL\",'Product benefit & adoption'!BB34*'Product benefit & adoption'!$P34/1000000,'Product benefit & adoption'!$G$4=\"2020-25\",'Product benefit & adoption'!BB34*'Product benefit & adoption'!$N34/1000000,'Product benefit & adoption'!$G$4=\"2015-20\",'Product benefit & adoption'!BB34*'Product benefit & adoption'!$L34/1000000)","v":0},{"$f":"_xlfn.IFS('Product benefit & adoption'!$G$4=\"ALL\",'Product benefit & adoption'!BC34*'Product benefit & adoption'!$P34/1000000,'Product benefit & adoption'!$G$4=\"2020-25\",'Product benefit & adoption'!BC34*'Product benefit & adoption'!$N34/1000000,'Product benefit & adoption'!$G$4=\"2015-20\",'Product benefit & adoption'!BC34*'Product benefit & adoption'!$L34/1000000)","v":0},{"$f":"_xlfn.IFS('Product benefit & adoption'!$G$4=\"ALL\",'Product benefit & adoption'!BD34*'Product benefit & adoption'!$P34/1000000,'Product benefit & adoption'!$G$4=\"2020-25\",'Product benefit & adoption'!BD34*'Product benefit & adoption'!$N34/1000000,'Product benefit & adoption'!$G$4=\"2015-20\",'Product benefit & adoption'!BD34*'Product benefit & adoption'!$L34/1000000)","v":0}]
[null,25,{"$f":"IF('Product benefit & adoption'!D35=\"\",\"\",'Product benefit & adoption'!D35)","v":""},{"$f":"IF('Product benefit & adoption'!F35=\"\",\"\",'Product benefit & adoption'!F35)","v":""},0,{"$f":"_xlfn.IFS('Product benefit & adoption'!$G$4=\"ALL\",'Product benefit & adoption'!AA35*'Product benefit & adoption'!$P35/1000000,'Product benefit & adoption'!$G$4=\"2020-25\",'Product benefit & adoption'!AA35*'Product benefit & adoption'!$N35/1000000,'Product benefit & adoption'!$G$4=\"2015-20\",'Product benefit & adoption'!AA35*'Product benefit & adoption'!$L35/1000000)","v":0},{"$f":"_xlfn.IFS('Product benefit & adoption'!$G$4=\"ALL\",'Product benefit & adoption'!AB35*'Product benefit & adoption'!$P35/1000000,'Product benefit & adoption'!$G$4=\"2020-25\",'Product benefit & adoption'!AB35*'Product benefit & adoption'!$N35/1000000,'Product benefit & adoption'!$G$4=\"2015-20\",'Product benefit & adoption'!AB35*'Product benefit & adoption'!$L35/1000000)","v":0},{"$f":"_xlfn.IFS('Product benefit & adoption'!$G$4=\"ALL\",'Product benefit & adoption'!AC35*'Product benefit & adoption'!$P35/1000000,'Product benefit & adoption'!$G$4=\"2020-25\",'Product benefit & adoption'!AC35*'Product benefit & adoption'!$N35/1000000,'Product benefit & adoption'!$G$4=\"2015-20\",'Product benefit & adoption'!AC35*'Product benefit & adoption'!$L35/1000000)","v":0},{"$f":"_xlfn.IFS('Product benefit & adoption'!$G$4=\"ALL\",'Product benefit & adoption'!AD35*'Product benefit & adoption'!$P35/1000000,'Product benefit & adoption'!$G$4=\"2020-25\",'Product benefit & adoption'!AD35*'Product benefit & adoption'!$N35/1000000,'Product benefit & adoption'!$G$4=\"2015-20\",'Product benefit & adoption'!AD35*'Product benefit & adoption'!$L35/1000000)","v":0},{"$f":"_xlfn.IFS('Product benefit & adoption'!$G$4=\"ALL\",'Product benefit & adoption'!AE35*'Product benefit & adoption'!$P35/1000000,'Product benefit & adoption'!$G$4=\"2020-25\",'Product benefit & adoption'!AE35*'Product benefit & adoption'!$N35/1000000,'Product benefit & adoption'!$G$4=\"2015-20\",'Product benefit & adoption'!AE35*'Product benefit & adoption'!$L35/1000000)","v":0},{"$f":"_xlfn.IFS('Product benefit & adoption'!$G$4=\"ALL\",'Product benefit & adoption'!AF35*'Product benefit & adoption'!$P35/1000000,'Product benefit & adoption'!$G$4=\"2020-25\",'Product benefit & adoption'!AF35*'Product benefit & adoption'!$N35/1000000,'Product benefit & adoption'!$G$4=\"2015-20\",'Product benefit & adoption'!AF35*'Product benefit & adoption'!$L35/1000000)","v":0},{"$f":"_xlfn.IFS('Product benefit & adoption'!$G$4=\"ALL\",'Product benefit & adoption'!AG35*'Product benefit & adoption'!$P35/1000000,'Product benefit & adoption'!$G$4=\"2020-25\",'Product benefit & adoption'!AG35*'Product benefit & adoption'!$N35/1000000,'Product benefit & adoption'!$G$4=\"2015-20\",'Product benefit & adoption'!AG35*'Product benefit & adoption'!$L35/1000000)","v":0},{"$f":"_xlfn.IFS('Product benefit & adoption'!$G$4=\"ALL\",'Product benefit & adoption'!AH35*'Product benefit & adoption'!$P35/1000000,'Product benefit & adoption'!$G$4=\"2020-25\",'Product benefit & adoption'!AH35*'Product benefit & adoption'!$N35/1000000,'Product benefit & adoption'!$G$4=\"2015-20\",'Product benefit & adoption'!AH35*'Product benefit & adoption'!$L35/1000000)","v":0},{"$f":"_xlfn.IFS('Product benefit & adoption'!$G$4=\"ALL\",'Product benefit & adoption'!AI35*'Product benefit & adoption'!$P35/1000000,'Product benefit & adoption'!$G$4=\"2020-25\",'Product benefit & adoption'!AI35*'Product benefit & adoption'!$N35/1000000,'Product benefit & adoption'!$G$4=\"2015-20\",'Product benefit & adoption'!AI35*'Product benefit & adoption'!$L35/1000000)","v":0},{"$f":"_xlfn.IFS('Product benefit & adoption'!$G$4=\"ALL\",'Product benefit & adoption'!AJ35*'Product benefit & adoption'!$P35/1000000,'Product benefit & adoption'!$G$4=\"2020-25\",'Product benefit & adoption'!AJ35*'Product benefit & adoption'!$N35/1000000,'Product benefit & adoption'!$G$4=\"2015-20\",'Product benefit & adoption'!AJ35*'Product benefit & adoption'!$L35/1000000)","v":0},{"$f":"_xlfn.IFS('Product benefit & adoption'!$G$4=\"ALL\",'Product benefit & adoption'!AK35*'Product benefit & adoption'!$P35/1000000,'Product benefit & adoption'!$G$4=\"2020-25\",'Product benefit & adoption'!AK35*'Product benefit & adoption'!$N35/1000000,'Product benefit & adoption'!$G$4=\"2015-20\",'Product benefit & adoption'!AK35*'Product benefit & adoption'!$L35/1000000)","v":0},{"$f":"_xlfn.IFS('Product benefit & adoption'!$G$4=\"ALL\",'Product benefit & adoption'!AL35*'Product benefit & adoption'!$P35/1000000,'Product benefit & adoption'!$G$4=\"2020-25\",'Product benefit & adoption'!AL35*'Product benefit & adoption'!$N35/1000000,'Product benefit & adoption'!$G$4=\"2015-20\",'Product benefit & adoption'!AL35*'Product benefit & adoption'!$L35/1000000)","v":0},{"$f":"_xlfn.IFS('Product benefit & adoption'!$G$4=\"ALL\",'Product benefit & adoption'!AM35*'Product benefit & adoption'!$P35/1000000,'Product benefit & adoption'!$G$4=\"2020-25\",'Product benefit & adoption'!AM35*'Product benefit & adoption'!$N35/1000000,'Product benefit & adoption'!$G$4=\"2015-20\",'Product benefit & adoption'!AM35*'Product benefit & adoption'!$L35/1000000)","v":0},{"$f":"_xlfn.IFS('Product benefit & adoption'!$G$4=\"ALL\",'Product benefit & adoption'!AN35*'Product benefit & adoption'!$P35/1000000,'Product benefit & adoption'!$G$4=\"2020-25\",'Product benefit & adoption'!AN35*'Product benefit & adoption'!$N35/1000000,'Product benefit & adoption'!$G$4=\"2015-20\",'Product benefit & adoption'!AN35*'Product benefit & adoption'!$L35/1000000)","v":0},{"$f":"_xlfn.IFS('Product benefit & adoption'!$G$4=\"ALL\",'Product benefit & adoption'!AO35*'Product benefit & adoption'!$P35/1000000,'Product benefit & adoption'!$G$4=\"2020-25\",'Product benefit & adoption'!AO35*'Product benefit & adoption'!$N35/1000000,'Product benefit & adoption'!$G$4=\"2015-20\",'Product benefit & adoption'!AO35*'Product benefit & adoption'!$L35/1000000)","v":0},{"$f":"_xlfn.IFS('Product benefit & adoption'!$G$4=\"ALL\",'Product benefit & adoption'!AP35*'Product benefit & adoption'!$P35/1000000,'Product benefit & adoption'!$G$4=\"2020-25\",'Product benefit & adoption'!AP35*'Product benefit & adoption'!$N35/1000000,'Product benefit & adoption'!$G$4=\"2015-20\",'Product benefit & adoption'!AP35*'Product benefit & adoption'!$L35/1000000)","v":0},{"$f":"_xlfn.IFS('Product benefit & adoption'!$G$4=\"ALL\",'Product benefit & adoption'!AQ35*'Product benefit & adoption'!$P35/1000000,'Product benefit & adoption'!$G$4=\"2020-25\",'Product benefit & adoption'!AQ35*'Product benefit & adoption'!$N35/1000000,'Product benefit & adoption'!$G$4=\"2015-20\",'Product benefit & adoption'!AQ35*'Product benefit & adoption'!$L35/1000000)","v":0},{"$f":"_xlfn.IFS('Product benefit & adoption'!$G$4=\"ALL\",'Product benefit & adoption'!AR35*'Product benefit & adoption'!$P35/1000000,'Product benefit & adoption'!$G$4=\"2020-25\",'Product benefit & adoption'!AR35*'Product benefit & adoption'!$N35/1000000,'Product benefit & adoption'!$G$4=\"2015-20\",'Product benefit & adoption'!AR35*'Product benefit & adoption'!$L35/1000000)","v":0},{"$f":"_xlfn.IFS('Product benefit & adoption'!$G$4=\"ALL\",'Product benefit & adoption'!AS35*'Product benefit & adoption'!$P35/1000000,'Product benefit & adoption'!$G$4=\"2020-25\",'Product benefit & adoption'!AS35*'Product benefit & adoption'!$N35/1000000,'Product benefit & adoption'!$G$4=\"2015-20\",'Product benefit & adoption'!AS35*'Product benefit & adoption'!$L35/1000000)","v":0},{"$f":"_xlfn.IFS('Product benefit & adoption'!$G$4=\"ALL\",'Product benefit & adoption'!AT35*'Product benefit & adoption'!$P35/1000000,'Product benefit & adoption'!$G$4=\"2020-25\",'Product benefit & adoption'!AT35*'Product benefit & adoption'!$N35/1000000,'Product benefit & adoption'!$G$4=\"2015-20\",'Product benefit & adoption'!AT35*'Product benefit & adoption'!$L35/1000000)","v":0},{"$f":"_xlfn.IFS('Product benefit & adoption'!$G$4=\"ALL\",'Product benefit & adoption'!AU35*'Product benefit & adoption'!$P35/1000000,'Product benefit & adoption'!$G$4=\"2020-25\",'Product benefit & adoption'!AU35*'Product benefit & adoption'!$N35/1000000,'Product benefit & adoption'!$G$4=\"2015-20\",'Product benefit & adoption'!AU35*'Product benefit & adoption'!$L35/1000000)","v":0},{"$f":"_xlfn.IFS('Product benefit & adoption'!$G$4=\"ALL\",'Product benefit & adoption'!AV35*'Product benefit & adoption'!$P35/1000000,'Product benefit & adoption'!$G$4=\"2020-25\",'Product benefit & adoption'!AV35*'Product benefit & adoption'!$N35/1000000,'Product benefit & adoption'!$G$4=\"2015-20\",'Product benefit & adoption'!AV35*'Product benefit & adoption'!$L35/1000000)","v":0},{"$f":"_xlfn.IFS('Product benefit & adoption'!$G$4=\"ALL\",'Product benefit & adoption'!AW35*'Product benefit & adoption'!$P35/1000000,'Product benefit & adoption'!$G$4=\"2020-25\",'Product benefit & adoption'!AW35*'Product benefit & adoption'!$N35/1000000,'Product benefit & adoption'!$G$4=\"2015-20\",'Product benefit & adoption'!AW35*'Product benefit & adoption'!$L35/1000000)","v":0},{"$f":"_xlfn.IFS('Product benefit & adoption'!$G$4=\"ALL\",'Product benefit & adoption'!AX35*'Product benefit & adoption'!$P35/1000000,'Product benefit & adoption'!$G$4=\"2020-25\",'Product benefit & adoption'!AX35*'Product benefit & adoption'!$N35/1000000,'Product benefit & adoption'!$G$4=\"2015-20\",'Product benefit & adoption'!AX35*'Product benefit & adoption'!$L35/1000000)","v":0},{"$f":"_xlfn.IFS('Product benefit & adoption'!$G$4=\"ALL\",'Product benefit & adoption'!AY35*'Product benefit & adoption'!$P35/1000000,'Product benefit & adoption'!$G$4=\"2020-25\",'Product benefit & adoption'!AY35*'Product benefit & adoption'!$N35/1000000,'Product benefit & adoption'!$G$4=\"2015-20\",'Product benefit & adoption'!AY35*'Product benefit & adoption'!$L35/1000000)","v":0},{"$f":"_xlfn.IFS('Product benefit & adoption'!$G$4=\"ALL\",'Product benefit & adoption'!AZ35*'Product benefit & adoption'!$P35/1000000,'Product benefit & adoption'!$G$4=\"2020-25\",'Product benefit & adoption'!AZ35*'Product benefit & adoption'!$N35/1000000,'Product benefit & adoption'!$G$4=\"2015-20\",'Product benefit & adoption'!AZ35*'Product benefit & adoption'!$L35/1000000)","v":0},{"$f":"_xlfn.IFS('Product benefit & adoption'!$G$4=\"ALL\",'Product benefit & adoption'!BA35*'Product benefit & adoption'!$P35/1000000,'Product benefit & adoption'!$G$4=\"2020-25\",'Product benefit & adoption'!BA35*'Product benefit & adoption'!$N35/1000000,'Product benefit & adoption'!$G$4=\"2015-20\",'Product benefit & adoption'!BA35*'Product benefit & adoption'!$L35/1000000)","v":0},{"$f":"_xlfn.IFS('Product benefit & adoption'!$G$4=\"ALL\",'Product benefit & adoption'!BB35*'Product benefit & adoption'!$P35/1000000,'Product benefit & adoption'!$G$4=\"2020-25\",'Product benefit & adoption'!BB35*'Product benefit & adoption'!$N35/1000000,'Product benefit & adoption'!$G$4=\"2015-20\",'Product benefit & adoption'!BB35*'Product benefit & adoption'!$L35/1000000)","v":0},{"$f":"_xlfn.IFS('Product benefit & adoption'!$G$4=\"ALL\",'Product benefit & adoption'!BC35*'Product benefit & adoption'!$P35/1000000,'Product benefit & adoption'!$G$4=\"2020-25\",'Product benefit & adoption'!BC35*'Product benefit & adoption'!$N35/1000000,'Product benefit & adoption'!$G$4=\"2015-20\",'Product benefit & adoption'!BC35*'Product benefit & adoption'!$L35/1000000)","v":0},{"$f":"_xlfn.IFS('Product benefit & adoption'!$G$4=\"ALL\",'Product benefit & adoption'!BD35*'Product benefit & adoption'!$P35/1000000,'Product benefit & adoption'!$G$4=\"2020-25\",'Product benefit & adoption'!BD35*'Product benefit & adoption'!$N35/1000000,'Product benefit & adoption'!$G$4=\"2015-20\",'Product benefit & adoption'!BD35*'Product benefit & adoption'!$L35/1000000)","v":0}]
[null,26,{"$f":"IF('Product benefit & adoption'!D36=\"\",\"\",'Product benefit & adoption'!D36)","v":""},{"$f":"IF('Product benefit & adoption'!F36=\"\",\"\",'Product benefit & adoption'!F36)","v":""},0,{"$f":"_xlfn.IFS('Product benefit & adoption'!$G$4=\"ALL\",'Product benefit & adoption'!AA36*'Product benefit & adoption'!$P36/1000000,'Product benefit & adoption'!$G$4=\"2020-25\",'Product benefit & adoption'!AA36*'Product benefit & adoption'!$N36/1000000,'Product benefit & adoption'!$G$4=\"2015-20\",'Product benefit & adoption'!AA36*'Product benefit & adoption'!$L36/1000000)","v":0},{"$f":"_xlfn.IFS('Product benefit & adoption'!$G$4=\"ALL\",'Product benefit & adoption'!AB36*'Product benefit & adoption'!$P36/1000000,'Product benefit & adoption'!$G$4=\"2020-25\",'Product benefit & adoption'!AB36*'Product benefit & adoption'!$N36/1000000,'Product benefit & adoption'!$G$4=\"2015-20\",'Product benefit & adoption'!AB36*'Product benefit & adoption'!$L36/1000000)","v":0},{"$f":"_xlfn.IFS('Product benefit & adoption'!$G$4=\"ALL\",'Product benefit & adoption'!AC36*'Product benefit & adoption'!$P36/1000000,'Product benefit & adoption'!$G$4=\"2020-25\",'Product benefit & adoption'!AC36*'Product benefit & adoption'!$N36/1000000,'Product benefit & adoption'!$G$4=\"2015-20\",'Product benefit & adoption'!AC36*'Product benefit & adoption'!$L36/1000000)","v":0},{"$f":"_xlfn.IFS('Product benefit & adoption'!$G$4=\"ALL\",'Product benefit & adoption'!AD36*'Product benefit & adoption'!$P36/1000000,'Product benefit & adoption'!$G$4=\"2020-25\",'Product benefit & adoption'!AD36*'Product benefit & adoption'!$N36/1000000,'Product benefit & adoption'!$G$4=\"2015-20\",'Product benefit & adoption'!AD36*'Product benefit & adoption'!$L36/1000000)","v":0},{"$f":"_xlfn.IFS('Product benefit & adoption'!$G$4=\"ALL\",'Product benefit & adoption'!AE36*'Product benefit & adoption'!$P36/1000000,'Product benefit & adoption'!$G$4=\"2020-25\",'Product benefit & adoption'!AE36*'Product benefit & adoption'!$N36/1000000,'Product benefit & adoption'!$G$4=\"2015-20\",'Product benefit & adoption'!AE36*'Product benefit & adoption'!$L36/1000000)","v":0},{"$f":"_xlfn.IFS('Product benefit & adoption'!$G$4=\"ALL\",'Product benefit & adoption'!AF36*'Product benefit & adoption'!$P36/1000000,'Product benefit & adoption'!$G$4=\"2020-25\",'Product benefit & adoption'!AF36*'Product benefit & adoption'!$N36/1000000,'Product benefit & adoption'!$G$4=\"2015-20\",'Product benefit & adoption'!AF36*'Product benefit & adoption'!$L36/1000000)","v":0},{"$f":"_xlfn.IFS('Product benefit & adoption'!$G$4=\"ALL\",'Product benefit & adoption'!AG36*'Product benefit & adoption'!$P36/1000000,'Product benefit & adoption'!$G$4=\"2020-25\",'Product benefit & adoption'!AG36*'Product benefit & adoption'!$N36/1000000,'Product benefit & adoption'!$G$4=\"2015-20\",'Product benefit & adoption'!AG36*'Product benefit & adoption'!$L36/1000000)","v":0},{"$f":"_xlfn.IFS('Product benefit & adoption'!$G$4=\"ALL\",'Product benefit & adoption'!AH36*'Product benefit & adoption'!$P36/1000000,'Product benefit & adoption'!$G$4=\"2020-25\",'Product benefit & adoption'!AH36*'Product benefit & adoption'!$N36/1000000,'Product benefit & adoption'!$G$4=\"2015-20\",'Product benefit & adoption'!AH36*'Product benefit & adoption'!$L36/1000000)","v":0},{"$f":"_xlfn.IFS('Product benefit & adoption'!$G$4=\"ALL\",'Product benefit & adoption'!AI36*'Product benefit & adoption'!$P36/1000000,'Product benefit & adoption'!$G$4=\"2020-25\",'Product benefit & adoption'!AI36*'Product benefit & adoption'!$N36/1000000,'Product benefit & adoption'!$G$4=\"2015-20\",'Product benefit & adoption'!AI36*'Product benefit & adoption'!$L36/1000000)","v":0},{"$f":"_xlfn.IFS('Product benefit & adoption'!$G$4=\"ALL\",'Product benefit & adoption'!AJ36*'Product benefit & adoption'!$P36/1000000,'Product benefit & adoption'!$G$4=\"2020-25\",'Product benefit & adoption'!AJ36*'Product benefit & adoption'!$N36/1000000,'Product benefit & adoption'!$G$4=\"2015-20\",'Product benefit & adoption'!AJ36*'Product benefit & adoption'!$L36/1000000)","v":0},{"$f":"_xlfn.IFS('Product benefit & adoption'!$G$4=\"ALL\",'Product benefit & adoption'!AK36*'Product benefit & adoption'!$P36/1000000,'Product benefit & adoption'!$G$4=\"2020-25\",'Product benefit & adoption'!AK36*'Product benefit & adoption'!$N36/1000000,'Product benefit & adoption'!$G$4=\"2015-20\",'Product benefit & adoption'!AK36*'Product benefit & adoption'!$L36/1000000)","v":0},{"$f":"_xlfn.IFS('Product benefit & adoption'!$G$4=\"ALL\",'Product benefit & adoption'!AL36*'Product benefit & adoption'!$P36/1000000,'Product benefit & adoption'!$G$4=\"2020-25\",'Product benefit & adoption'!AL36*'Product benefit & adoption'!$N36/1000000,'Product benefit & adoption'!$G$4=\"2015-20\",'Product benefit & adoption'!AL36*'Product benefit & adoption'!$L36/1000000)","v":0},{"$f":"_xlfn.IFS('Product benefit & adoption'!$G$4=\"ALL\",'Product benefit & adoption'!AM36*'Product benefit & adoption'!$P36/1000000,'Product benefit & adoption'!$G$4=\"2020-25\",'Product benefit & adoption'!AM36*'Product benefit & adoption'!$N36/1000000,'Product benefit & adoption'!$G$4=\"2015-20\",'Product benefit & adoption'!AM36*'Product benefit & adoption'!$L36/1000000)","v":0},{"$f":"_xlfn.IFS('Product benefit & adoption'!$G$4=\"ALL\",'Product benefit & adoption'!AN36*'Product benefit & adoption'!$P36/1000000,'Product benefit & adoption'!$G$4=\"2020-25\",'Product benefit & adoption'!AN36*'Product benefit & adoption'!$N36/1000000,'Product benefit & adoption'!$G$4=\"2015-20\",'Product benefit & adoption'!AN36*'Product benefit & adoption'!$L36/1000000)","v":0},{"$f":"_xlfn.IFS('Product benefit & adoption'!$G$4=\"ALL\",'Product benefit & adoption'!AO36*'Product benefit & adoption'!$P36/1000000,'Product benefit & adoption'!$G$4=\"2020-25\",'Product benefit & adoption'!AO36*'Product benefit & adoption'!$N36/1000000,'Product benefit & adoption'!$G$4=\"2015-20\",'Product benefit & adoption'!AO36*'Product benefit & adoption'!$L36/1000000)","v":0},{"$f":"_xlfn.IFS('Product benefit & adoption'!$G$4=\"ALL\",'Product benefit & adoption'!AP36*'Product benefit & adoption'!$P36/1000000,'Product benefit & adoption'!$G$4=\"2020-25\",'Product benefit & adoption'!AP36*'Product benefit & adoption'!$N36/1000000,'Product benefit & adoption'!$G$4=\"2015-20\",'Product benefit & adoption'!AP36*'Product benefit & adoption'!$L36/1000000)","v":0},{"$f":"_xlfn.IFS('Product benefit & adoption'!$G$4=\"ALL\",'Product benefit & adoption'!AQ36*'Product benefit & adoption'!$P36/1000000,'Product benefit & adoption'!$G$4=\"2020-25\",'Product benefit & adoption'!AQ36*'Product benefit & adoption'!$N36/1000000,'Product benefit & adoption'!$G$4=\"2015-20\",'Product benefit & adoption'!AQ36*'Product benefit & adoption'!$L36/1000000)","v":0},{"$f":"_xlfn.IFS('Product benefit & adoption'!$G$4=\"ALL\",'Product benefit & adoption'!AR36*'Product benefit & adoption'!$P36/1000000,'Product benefit & adoption'!$G$4=\"2020-25\",'Product benefit & adoption'!AR36*'Product benefit & adoption'!$N36/1000000,'Product benefit & adoption'!$G$4=\"2015-20\",'Product benefit & adoption'!AR36*'Product benefit & adoption'!$L36/1000000)","v":0},{"$f":"_xlfn.IFS('Product benefit & adoption'!$G$4=\"ALL\",'Product benefit & adoption'!AS36*'Product benefit & adoption'!$P36/1000000,'Product benefit & adoption'!$G$4=\"2020-25\",'Product benefit & adoption'!AS36*'Product benefit & adoption'!$N36/1000000,'Product benefit & adoption'!$G$4=\"2015-20\",'Product benefit & adoption'!AS36*'Product benefit & adoption'!$L36/1000000)","v":0},{"$f":"_xlfn.IFS('Product benefit & adoption'!$G$4=\"ALL\",'Product benefit & adoption'!AT36*'Product benefit & adoption'!$P36/1000000,'Product benefit & adoption'!$G$4=\"2020-25\",'Product benefit & adoption'!AT36*'Product benefit & adoption'!$N36/1000000,'Product benefit & adoption'!$G$4=\"2015-20\",'Product benefit & adoption'!AT36*'Product benefit & adoption'!$L36/1000000)","v":0},{"$f":"_xlfn.IFS('Product benefit & adoption'!$G$4=\"ALL\",'Product benefit & adoption'!AU36*'Product benefit & adoption'!$P36/1000000,'Product benefit & adoption'!$G$4=\"2020-25\",'Product benefit & adoption'!AU36*'Product benefit & adoption'!$N36/1000000,'Product benefit & adoption'!$G$4=\"2015-20\",'Product benefit & adoption'!AU36*'Product benefit & adoption'!$L36/1000000)","v":0},{"$f":"_xlfn.IFS('Product benefit & adoption'!$G$4=\"ALL\",'Product benefit & adoption'!AV36*'Product benefit & adoption'!$P36/1000000,'Product benefit & adoption'!$G$4=\"2020-25\",'Product benefit & adoption'!AV36*'Product benefit & adoption'!$N36/1000000,'Product benefit & adoption'!$G$4=\"2015-20\",'Product benefit & adoption'!AV36*'Product benefit & adoption'!$L36/1000000)","v":0},{"$f":"_xlfn.IFS('Product benefit & adoption'!$G$4=\"ALL\",'Product benefit & adoption'!AW36*'Product benefit & adoption'!$P36/1000000,'Product benefit & adoption'!$G$4=\"2020-25\",'Product benefit & adoption'!AW36*'Product benefit & adoption'!$N36/1000000,'Product benefit & adoption'!$G$4=\"2015-20\",'Product benefit & adoption'!AW36*'Product benefit & adoption'!$L36/1000000)","v":0},{"$f":"_xlfn.IFS('Product benefit & adoption'!$G$4=\"ALL\",'Product benefit & adoption'!AX36*'Product benefit & adoption'!$P36/1000000,'Product benefit & adoption'!$G$4=\"2020-25\",'Product benefit & adoption'!AX36*'Product benefit & adoption'!$N36/1000000,'Product benefit & adoption'!$G$4=\"2015-20\",'Product benefit & adoption'!AX36*'Product benefit & adoption'!$L36/1000000)","v":0},{"$f":"_xlfn.IFS('Product benefit & adoption'!$G$4=\"ALL\",'Product benefit & adoption'!AY36*'Product benefit & adoption'!$P36/1000000,'Product benefit & adoption'!$G$4=\"2020-25\",'Product benefit & adoption'!AY36*'Product benefit & adoption'!$N36/1000000,'Product benefit & adoption'!$G$4=\"2015-20\",'Product benefit & adoption'!AY36*'Product benefit & adoption'!$L36/1000000)","v":0},{"$f":"_xlfn.IFS('Product benefit & adoption'!$G$4=\"ALL\",'Product benefit & adoption'!AZ36*'Product benefit & adoption'!$P36/1000000,'Product benefit & adoption'!$G$4=\"2020-25\",'Product benefit & adoption'!AZ36*'Product benefit & adoption'!$N36/1000000,'Product benefit & adoption'!$G$4=\"2015-20\",'Product benefit & adoption'!AZ36*'Product benefit & adoption'!$L36/1000000)","v":0},{"$f":"_xlfn.IFS('Product benefit & adoption'!$G$4=\"ALL\",'Product benefit & adoption'!BA36*'Product benefit & adoption'!$P36/1000000,'Product benefit & adoption'!$G$4=\"2020-25\",'Product benefit & adoption'!BA36*'Product benefit & adoption'!$N36/1000000,'Product benefit & adoption'!$G$4=\"2015-20\",'Product benefit & adoption'!BA36*'Product benefit & adoption'!$L36/1000000)","v":0},{"$f":"_xlfn.IFS('Product benefit & adoption'!$G$4=\"ALL\",'Product benefit & adoption'!BB36*'Product benefit & adoption'!$P36/1000000,'Product benefit & adoption'!$G$4=\"2020-25\",'Product benefit & adoption'!BB36*'Product benefit & adoption'!$N36/1000000,'Product benefit & adoption'!$G$4=\"2015-20\",'Product benefit & adoption'!BB36*'Product benefit & adoption'!$L36/1000000)","v":0},{"$f":"_xlfn.IFS('Product benefit & adoption'!$G$4=\"ALL\",'Product benefit & adoption'!BC36*'Product benefit & adoption'!$P36/1000000,'Product benefit & adoption'!$G$4=\"2020-25\",'Product benefit & adoption'!BC36*'Product benefit & adoption'!$N36/1000000,'Product benefit & adoption'!$G$4=\"2015-20\",'Product benefit & adoption'!BC36*'Product benefit & adoption'!$L36/1000000)","v":0},{"$f":"_xlfn.IFS('Product benefit & adoption'!$G$4=\"ALL\",'Product benefit & adoption'!BD36*'Product benefit & adoption'!$P36/1000000,'Product benefit & adoption'!$G$4=\"2020-25\",'Product benefit & adoption'!BD36*'Product benefit & adoption'!$N36/1000000,'Product benefit & adoption'!$G$4=\"2015-20\",'Product benefit & adoption'!BD36*'Product benefit & adoption'!$L36/1000000)","v":0}]
[null,27,{"$f":"IF('Product benefit & adoption'!D37=\"\",\"\",'Product benefit & adoption'!D37)","v":""},{"$f":"IF('Product benefit & adoption'!F37=\"\",\"\",'Product benefit & adoption'!F37)","v":""},0,{"$f":"_xlfn.IFS('Product benefit & adoption'!$G$4=\"ALL\",'Product benefit & adoption'!AA37*'Product benefit & adoption'!$P37/1000000,'Product benefit & adoption'!$G$4=\"2020-25\",'Product benefit & adoption'!AA37*'Product benefit & adoption'!$N37/1000000,'Product benefit & adoption'!$G$4=\"2015-20\",'Product benefit & adoption'!AA37*'Product benefit & adoption'!$L37/1000000)","v":0},{"$f":"_xlfn.IFS('Product benefit & adoption'!$G$4=\"ALL\",'Product benefit & adoption'!AB37*'Product benefit & adoption'!$P37/1000000,'Product benefit & adoption'!$G$4=\"2020-25\",'Product benefit & adoption'!AB37*'Product benefit & adoption'!$N37/1000000,'Product benefit & adoption'!$G$4=\"2015-20\",'Product benefit & adoption'!AB37*'Product benefit & adoption'!$L37/1000000)","v":0},{"$f":"_xlfn.IFS('Product benefit & adoption'!$G$4=\"ALL\",'Product benefit & adoption'!AC37*'Product benefit & adoption'!$P37/1000000,'Product benefit & adoption'!$G$4=\"2020-25\",'Product benefit & adoption'!AC37*'Product benefit & adoption'!$N37/1000000,'Product benefit & adoption'!$G$4=\"2015-20\",'Product benefit & adoption'!AC37*'Product benefit & adoption'!$L37/1000000)","v":0},{"$f":"_xlfn.IFS('Product benefit & adoption'!$G$4=\"ALL\",'Product benefit & adoption'!AD37*'Product benefit & adoption'!$P37/1000000,'Product benefit & adoption'!$G$4=\"2020-25\",'Product benefit & adoption'!AD37*'Product benefit & adoption'!$N37/1000000,'Product benefit & adoption'!$G$4=\"2015-20\",'Product benefit & adoption'!AD37*'Product benefit & adoption'!$L37/1000000)","v":0},{"$f":"_xlfn.IFS('Product benefit & adoption'!$G$4=\"ALL\",'Product benefit & adoption'!AE37*'Product benefit & adoption'!$P37/1000000,'Product benefit & adoption'!$G$4=\"2020-25\",'Product benefit & adoption'!AE37*'Product benefit & adoption'!$N37/1000000,'Product benefit & adoption'!$G$4=\"2015-20\",'Product benefit & adoption'!AE37*'Product benefit & adoption'!$L37/1000000)","v":0},{"$f":"_xlfn.IFS('Product benefit & adoption'!$G$4=\"ALL\",'Product benefit & adoption'!AF37*'Product benefit & adoption'!$P37/1000000,'Product benefit & adoption'!$G$4=\"2020-25\",'Product benefit & adoption'!AF37*'Product benefit & adoption'!$N37/1000000,'Product benefit & adoption'!$G$4=\"2015-20\",'Product benefit & adoption'!AF37*'Product benefit & adoption'!$L37/1000000)","v":0},{"$f":"_xlfn.IFS('Product benefit & adoption'!$G$4=\"ALL\",'Product benefit & adoption'!AG37*'Product benefit & adoption'!$P37/1000000,'Product benefit & adoption'!$G$4=\"2020-25\",'Product benefit & adoption'!AG37*'Product benefit & adoption'!$N37/1000000,'Product benefit & adoption'!$G$4=\"2015-20\",'Product benefit & adoption'!AG37*'Product benefit & adoption'!$L37/1000000)","v":0},{"$f":"_xlfn.IFS('Product benefit & adoption'!$G$4=\"ALL\",'Product benefit & adoption'!AH37*'Product benefit & adoption'!$P37/1000000,'Product benefit & adoption'!$G$4=\"2020-25\",'Product benefit & adoption'!AH37*'Product benefit & adoption'!$N37/1000000,'Product benefit & adoption'!$G$4=\"2015-20\",'Product benefit & adoption'!AH37*'Product benefit & adoption'!$L37/1000000)","v":0},{"$f":"_xlfn.IFS('Product benefit & adoption'!$G$4=\"ALL\",'Product benefit & adoption'!AI37*'Product benefit & adoption'!$P37/1000000,'Product benefit & adoption'!$G$4=\"2020-25\",'Product benefit & adoption'!AI37*'Product benefit & adoption'!$N37/1000000,'Product benefit & adoption'!$G$4=\"2015-20\",'Product benefit & adoption'!AI37*'Product benefit & adoption'!$L37/1000000)","v":0},{"$f":"_xlfn.IFS('Product benefit & adoption'!$G$4=\"ALL\",'Product benefit & adoption'!AJ37*'Product benefit & adoption'!$P37/1000000,'Product benefit & adoption'!$G$4=\"2020-25\",'Product benefit & adoption'!AJ37*'Product benefit & adoption'!$N37/1000000,'Product benefit & adoption'!$G$4=\"2015-20\",'Product benefit & adoption'!AJ37*'Product benefit & adoption'!$L37/1000000)","v":0},{"$f":"_xlfn.IFS('Product benefit & adoption'!$G$4=\"ALL\",'Product benefit & adoption'!AK37*'Product benefit & adoption'!$P37/1000000,'Product benefit & adoption'!$G$4=\"2020-25\",'Product benefit & adoption'!AK37*'Product benefit & adoption'!$N37/1000000,'Product benefit & adoption'!$G$4=\"2015-20\",'Product benefit & adoption'!AK37*'Product benefit & adoption'!$L37/1000000)","v":0},{"$f":"_xlfn.IFS('Product benefit & adoption'!$G$4=\"ALL\",'Product benefit & adoption'!AL37*'Product benefit & adoption'!$P37/1000000,'Product benefit & adoption'!$G$4=\"2020-25\",'Product benefit & adoption'!AL37*'Product benefit & adoption'!$N37/1000000,'Product benefit & adoption'!$G$4=\"2015-20\",'Product benefit & adoption'!AL37*'Product benefit & adoption'!$L37/1000000)","v":0},{"$f":"_xlfn.IFS('Product benefit & adoption'!$G$4=\"ALL\",'Product benefit & adoption'!AM37*'Product benefit & adoption'!$P37/1000000,'Product benefit & adoption'!$G$4=\"2020-25\",'Product benefit & adoption'!AM37*'Product benefit & adoption'!$N37/1000000,'Product benefit & adoption'!$G$4=\"2015-20\",'Product benefit & adoption'!AM37*'Product benefit & adoption'!$L37/1000000)","v":0},{"$f":"_xlfn.IFS('Product benefit & adoption'!$G$4=\"ALL\",'Product benefit & adoption'!AN37*'Product benefit & adoption'!$P37/1000000,'Product benefit & adoption'!$G$4=\"2020-25\",'Product benefit & adoption'!AN37*'Product benefit & adoption'!$N37/1000000,'Product benefit & adoption'!$G$4=\"2015-20\",'Product benefit & adoption'!AN37*'Product benefit & adoption'!$L37/1000000)","v":0},{"$f":"_xlfn.IFS('Product benefit & adoption'!$G$4=\"ALL\",'Product benefit & adoption'!AO37*'Product benefit & adoption'!$P37/1000000,'Product benefit & adoption'!$G$4=\"2020-25\",'Product benefit & adoption'!AO37*'Product benefit & adoption'!$N37/1000000,'Product benefit & adoption'!$G$4=\"2015-20\",'Product benefit & adoption'!AO37*'Product benefit & adoption'!$L37/1000000)","v":0},{"$f":"_xlfn.IFS('Product benefit & adoption'!$G$4=\"ALL\",'Product benefit & adoption'!AP37*'Product benefit & adoption'!$P37/1000000,'Product benefit & adoption'!$G$4=\"2020-25\",'Product benefit & adoption'!AP37*'Product benefit & adoption'!$N37/1000000,'Product benefit & adoption'!$G$4=\"2015-20\",'Product benefit & adoption'!AP37*'Product benefit & adoption'!$L37/1000000)","v":0},{"$f":"_xlfn.IFS('Product benefit & adoption'!$G$4=\"ALL\",'Product benefit & adoption'!AQ37*'Product benefit & adoption'!$P37/1000000,'Product benefit & adoption'!$G$4=\"2020-25\",'Product benefit & adoption'!AQ37*'Product benefit & adoption'!$N37/1000000,'Product benefit & adoption'!$G$4=\"2015-20\",'Product benefit & adoption'!AQ37*'Product benefit & adoption'!$L37/1000000)","v":0},{"$f":"_xlfn.IFS('Product benefit & adoption'!$G$4=\"ALL\",'Product benefit & adoption'!AR37*'Product benefit & adoption'!$P37/1000000,'Product benefit & adoption'!$G$4=\"2020-25\",'Product benefit & adoption'!AR37*'Product benefit & adoption'!$N37/1000000,'Product benefit & adoption'!$G$4=\"2015-20\",'Product benefit & adoption'!AR37*'Product benefit & adoption'!$L37/1000000)","v":0},{"$f":"_xlfn.IFS('Product benefit & adoption'!$G$4=\"ALL\",'Product benefit & adoption'!AS37*'Product benefit & adoption'!$P37/1000000,'Product benefit & adoption'!$G$4=\"2020-25\",'Product benefit & adoption'!AS37*'Product benefit & adoption'!$N37/1000000,'Product benefit & adoption'!$G$4=\"2015-20\",'Product benefit & adoption'!AS37*'Product benefit & adoption'!$L37/1000000)","v":0},{"$f":"_xlfn.IFS('Product benefit & adoption'!$G$4=\"ALL\",'Product benefit & adoption'!AT37*'Product benefit & adoption'!$P37/1000000,'Product benefit & adoption'!$G$4=\"2020-25\",'Product benefit & adoption'!AT37*'Product benefit & adoption'!$N37/1000000,'Product benefit & adoption'!$G$4=\"2015-20\",'Product benefit & adoption'!AT37*'Product benefit & adoption'!$L37/1000000)","v":0},{"$f":"_xlfn.IFS('Product benefit & adoption'!$G$4=\"ALL\",'Product benefit & adoption'!AU37*'Product benefit & adoption'!$P37/1000000,'Product benefit & adoption'!$G$4=\"2020-25\",'Product benefit & adoption'!AU37*'Product benefit & adoption'!$N37/1000000,'Product benefit & adoption'!$G$4=\"2015-20\",'Product benefit & adoption'!AU37*'Product benefit & adoption'!$L37/1000000)","v":0},{"$f":"_xlfn.IFS('Product benefit & adoption'!$G$4=\"ALL\",'Product benefit & adoption'!AV37*'Product benefit & adoption'!$P37/1000000,'Product benefit & adoption'!$G$4=\"2020-25\",'Product benefit & adoption'!AV37*'Product benefit & adoption'!$N37/1000000,'Product benefit & adoption'!$G$4=\"2015-20\",'Product benefit & adoption'!AV37*'Product benefit & adoption'!$L37/1000000)","v":0},{"$f":"_xlfn.IFS('Product benefit & adoption'!$G$4=\"ALL\",'Product benefit & adoption'!AW37*'Product benefit & adoption'!$P37/1000000,'Product benefit & adoption'!$G$4=\"2020-25\",'Product benefit & adoption'!AW37*'Product benefit & adoption'!$N37/1000000,'Product benefit & adoption'!$G$4=\"2015-20\",'Product benefit & adoption'!AW37*'Product benefit & adoption'!$L37/1000000)","v":0},{"$f":"_xlfn.IFS('Product benefit & adoption'!$G$4=\"ALL\",'Product benefit & adoption'!AX37*'Product benefit & adoption'!$P37/1000000,'Product benefit & adoption'!$G$4=\"2020-25\",'Product benefit & adoption'!AX37*'Product benefit & adoption'!$N37/1000000,'Product benefit & adoption'!$G$4=\"2015-20\",'Product benefit & adoption'!AX37*'Product benefit & adoption'!$L37/1000000)","v":0},{"$f":"_xlfn.IFS('Product benefit & adoption'!$G$4=\"ALL\",'Product benefit & adoption'!AY37*'Product benefit & adoption'!$P37/1000000,'Product benefit & adoption'!$G$4=\"2020-25\",'Product benefit & adoption'!AY37*'Product benefit & adoption'!$N37/1000000,'Product benefit & adoption'!$G$4=\"2015-20\",'Product benefit & adoption'!AY37*'Product benefit & adoption'!$L37/1000000)","v":0},{"$f":"_xlfn.IFS('Product benefit & adoption'!$G$4=\"ALL\",'Product benefit & adoption'!AZ37*'Product benefit & adoption'!$P37/1000000,'Product benefit & adoption'!$G$4=\"2020-25\",'Product benefit & adoption'!AZ37*'Product benefit & adoption'!$N37/1000000,'Product benefit & adoption'!$G$4=\"2015-20\",'Product benefit & adoption'!AZ37*'Product benefit & adoption'!$L37/1000000)","v":0},{"$f":"_xlfn.IFS('Product benefit & adoption'!$G$4=\"ALL\",'Product benefit & adoption'!BA37*'Product benefit & adoption'!$P37/1000000,'Product benefit & adoption'!$G$4=\"2020-25\",'Product benefit & adoption'!BA37*'Product benefit & adoption'!$N37/1000000,'Product benefit & adoption'!$G$4=\"2015-20\",'Product benefit & adoption'!BA37*'Product benefit & adoption'!$L37/1000000)","v":0},{"$f":"_xlfn.IFS('Product benefit & adoption'!$G$4=\"ALL\",'Product benefit & adoption'!BB37*'Product benefit & adoption'!$P37/1000000,'Product benefit & adoption'!$G$4=\"2020-25\",'Product benefit & adoption'!BB37*'Product benefit & adoption'!$N37/1000000,'Product benefit & adoption'!$G$4=\"2015-20\",'Product benefit & adoption'!BB37*'Product benefit & adoption'!$L37/1000000)","v":0},{"$f":"_xlfn.IFS('Product benefit & adoption'!$G$4=\"ALL\",'Product benefit & adoption'!BC37*'Product benefit & adoption'!$P37/1000000,'Product benefit & adoption'!$G$4=\"2020-25\",'Product benefit & adoption'!BC37*'Product benefit & adoption'!$N37/1000000,'Product benefit & adoption'!$G$4=\"2015-20\",'Product benefit & adoption'!BC37*'Product benefit & adoption'!$L37/1000000)","v":0},{"$f":"_xlfn.IFS('Product benefit & adoption'!$G$4=\"ALL\",'Product benefit & adoption'!BD37*'Product benefit & adoption'!$P37/1000000,'Product benefit & adoption'!$G$4=\"2020-25\",'Product benefit & adoption'!BD37*'Product benefit & adoption'!$N37/1000000,'Product benefit & adoption'!$G$4=\"2015-20\",'Product benefit & adoption'!BD37*'Product benefit & adoption'!$L37/1000000)","v":0}]
[null,28,{"$f":"IF('Product benefit & adoption'!D38=\"\",\"\",'Product benefit & adoption'!D38)","v":""},{"$f":"IF('Product benefit & adoption'!F38=\"\",\"\",'Product benefit & adoption'!F38)","v":""},0,{"$f":"_xlfn.IFS('Product benefit & adoption'!$G$4=\"ALL\",'Product benefit & adoption'!AA38*'Product benefit & adoption'!$P38/1000000,'Product benefit & adoption'!$G$4=\"2020-25\",'Product benefit & adoption'!AA38*'Product benefit & adoption'!$N38/1000000,'Product benefit & adoption'!$G$4=\"2015-20\",'Product benefit & adoption'!AA38*'Product benefit & adoption'!$L38/1000000)","v":0},{"$f":"_xlfn.IFS('Product benefit & adoption'!$G$4=\"ALL\",'Product benefit & adoption'!AB38*'Product benefit & adoption'!$P38/1000000,'Product benefit & adoption'!$G$4=\"2020-25\",'Product benefit & adoption'!AB38*'Product benefit & adoption'!$N38/1000000,'Product benefit & adoption'!$G$4=\"2015-20\",'Product benefit & adoption'!AB38*'Product benefit & adoption'!$L38/1000000)","v":0},{"$f":"_xlfn.IFS('Product benefit & adoption'!$G$4=\"ALL\",'Product benefit & adoption'!AC38*'Product benefit & adoption'!$P38/1000000,'Product benefit & adoption'!$G$4=\"2020-25\",'Product benefit & adoption'!AC38*'Product benefit & adoption'!$N38/1000000,'Product benefit & adoption'!$G$4=\"2015-20\",'Product benefit & adoption'!AC38*'Product benefit & adoption'!$L38/1000000)","v":0},{"$f":"_xlfn.IFS('Product benefit & adoption'!$G$4=\"ALL\",'Product benefit & adoption'!AD38*'Product benefit & adoption'!$P38/1000000,'Product benefit & adoption'!$G$4=\"2020-25\",'Product benefit & adoption'!AD38*'Product benefit & adoption'!$N38/1000000,'Product benefit & adoption'!$G$4=\"2015-20\",'Product benefit & adoption'!AD38*'Product benefit & adoption'!$L38/1000000)","v":0},{"$f":"_xlfn.IFS('Product benefit & adoption'!$G$4=\"ALL\",'Product benefit & adoption'!AE38*'Product benefit & adoption'!$P38/1000000,'Product benefit & adoption'!$G$4=\"2020-25\",'Product benefit & adoption'!AE38*'Product benefit & adoption'!$N38/1000000,'Product benefit & adoption'!$G$4=\"2015-20\",'Product benefit & adoption'!AE38*'Product benefit & adoption'!$L38/1000000)","v":0},{"$f":"_xlfn.IFS('Product benefit & adoption'!$G$4=\"ALL\",'Product benefit & adoption'!AF38*'Product benefit & adoption'!$P38/1000000,'Product benefit & adoption'!$G$4=\"2020-25\",'Product benefit & adoption'!AF38*'Product benefit & adoption'!$N38/1000000,'Product benefit & adoption'!$G$4=\"2015-20\",'Product benefit & adoption'!AF38*'Product benefit & adoption'!$L38/1000000)","v":0},{"$f":"_xlfn.IFS('Product benefit & adoption'!$G$4=\"ALL\",'Product benefit & adoption'!AG38*'Product benefit & adoption'!$P38/1000000,'Product benefit & adoption'!$G$4=\"2020-25\",'Product benefit & adoption'!AG38*'Product benefit & adoption'!$N38/1000000,'Product benefit & adoption'!$G$4=\"2015-20\",'Product benefit & adoption'!AG38*'Product benefit & adoption'!$L38/1000000)","v":0},{"$f":"_xlfn.IFS('Product benefit & adoption'!$G$4=\"ALL\",'Product benefit & adoption'!AH38*'Product benefit & adoption'!$P38/1000000,'Product benefit & adoption'!$G$4=\"2020-25\",'Product benefit & adoption'!AH38*'Product benefit & adoption'!$N38/1000000,'Product benefit & adoption'!$G$4=\"2015-20\",'Product benefit & adoption'!AH38*'Product benefit & adoption'!$L38/1000000)","v":0},{"$f":"_xlfn.IFS('Product benefit & adoption'!$G$4=\"ALL\",'Product benefit & adoption'!AI38*'Product benefit & adoption'!$P38/1000000,'Product benefit & adoption'!$G$4=\"2020-25\",'Product benefit & adoption'!AI38*'Product benefit & adoption'!$N38/1000000,'Product benefit & adoption'!$G$4=\"2015-20\",'Product benefit & adoption'!AI38*'Product benefit & adoption'!$L38/1000000)","v":0},{"$f":"_xlfn.IFS('Product benefit & adoption'!$G$4=\"ALL\",'Product benefit & adoption'!AJ38*'Product benefit & adoption'!$P38/1000000,'Product benefit & adoption'!$G$4=\"2020-25\",'Product benefit & adoption'!AJ38*'Product benefit & adoption'!$N38/1000000,'Product benefit & adoption'!$G$4=\"2015-20\",'Product benefit & adoption'!AJ38*'Product benefit & adoption'!$L38/1000000)","v":0},{"$f":"_xlfn.IFS('Product benefit & adoption'!$G$4=\"ALL\",'Product benefit & adoption'!AK38*'Product benefit & adoption'!$P38/1000000,'Product benefit & adoption'!$G$4=\"2020-25\",'Product benefit & adoption'!AK38*'Product benefit & adoption'!$N38/1000000,'Product benefit & adoption'!$G$4=\"2015-20\",'Product benefit & adoption'!AK38*'Product benefit & adoption'!$L38/1000000)","v":0},{"$f":"_xlfn.IFS('Product benefit & adoption'!$G$4=\"ALL\",'Product benefit & adoption'!AL38*'Product benefit & adoption'!$P38/1000000,'Product benefit & adoption'!$G$4=\"2020-25\",'Product benefit & adoption'!AL38*'Product benefit & adoption'!$N38/1000000,'Product benefit & adoption'!$G$4=\"2015-20\",'Product benefit & adoption'!AL38*'Product benefit & adoption'!$L38/1000000)","v":0},{"$f":"_xlfn.IFS('Product benefit & adoption'!$G$4=\"ALL\",'Product benefit & adoption'!AM38*'Product benefit & adoption'!$P38/1000000,'Product benefit & adoption'!$G$4=\"2020-25\",'Product benefit & adoption'!AM38*'Product benefit & adoption'!$N38/1000000,'Product benefit & adoption'!$G$4=\"2015-20\",'Product benefit & adoption'!AM38*'Product benefit & adoption'!$L38/1000000)","v":0},{"$f":"_xlfn.IFS('Product benefit & adoption'!$G$4=\"ALL\",'Product benefit & adoption'!AN38*'Product benefit & adoption'!$P38/1000000,'Product benefit & adoption'!$G$4=\"2020-25\",'Product benefit & adoption'!AN38*'Product benefit & adoption'!$N38/1000000,'Product benefit & adoption'!$G$4=\"2015-20\",'Product benefit & adoption'!AN38*'Product benefit & adoption'!$L38/1000000)","v":0},{"$f":"_xlfn.IFS('Product benefit & adoption'!$G$4=\"ALL\",'Product benefit & adoption'!AO38*'Product benefit & adoption'!$P38/1000000,'Product benefit & adoption'!$G$4=\"2020-25\",'Product benefit & adoption'!AO38*'Product benefit & adoption'!$N38/1000000,'Product benefit & adoption'!$G$4=\"2015-20\",'Product benefit & adoption'!AO38*'Product benefit & adoption'!$L38/1000000)","v":0},{"$f":"_xlfn.IFS('Product benefit & adoption'!$G$4=\"ALL\",'Product benefit & adoption'!AP38*'Product benefit & adoption'!$P38/1000000,'Product benefit & adoption'!$G$4=\"2020-25\",'Product benefit & adoption'!AP38*'Product benefit & adoption'!$N38/1000000,'Product benefit & adoption'!$G$4=\"2015-20\",'Product benefit & adoption'!AP38*'Product benefit & adoption'!$L38/1000000)","v":0},{"$f":"_xlfn.IFS('Product benefit & adoption'!$G$4=\"ALL\",'Product benefit & adoption'!AQ38*'Product benefit & adoption'!$P38/1000000,'Product benefit & adoption'!$G$4=\"2020-25\",'Product benefit & adoption'!AQ38*'Product benefit & adoption'!$N38/1000000,'Product benefit & adoption'!$G$4=\"2015-20\",'Product benefit & adoption'!AQ38*'Product benefit & adoption'!$L38/1000000)","v":0},{"$f":"_xlfn.IFS('Product benefit & adoption'!$G$4=\"ALL\",'Product benefit & adoption'!AR38*'Product benefit & adoption'!$P38/1000000,'Product benefit & adoption'!$G$4=\"2020-25\",'Product benefit & adoption'!AR38*'Product benefit & adoption'!$N38/1000000,'Product benefit & adoption'!$G$4=\"2015-20\",'Product benefit & adoption'!AR38*'Product benefit & adoption'!$L38/1000000)","v":0},{"$f":"_xlfn.IFS('Product benefit & adoption'!$G$4=\"ALL\",'Product benefit & adoption'!AS38*'Product benefit & adoption'!$P38/1000000,'Product benefit & adoption'!$G$4=\"2020-25\",'Product benefit & adoption'!AS38*'Product benefit & adoption'!$N38/1000000,'Product benefit & adoption'!$G$4=\"2015-20\",'Product benefit & adoption'!AS38*'Product benefit & adoption'!$L38/1000000)","v":0},{"$f":"_xlfn.IFS('Product benefit & adoption'!$G$4=\"ALL\",'Product benefit & adoption'!AT38*'Product benefit & adoption'!$P38/1000000,'Product benefit & adoption'!$G$4=\"2020-25\",'Product benefit & adoption'!AT38*'Product benefit & adoption'!$N38/1000000,'Product benefit & adoption'!$G$4=\"2015-20\",'Product benefit & adoption'!AT38*'Product benefit & adoption'!$L38/1000000)","v":0},{"$f":"_xlfn.IFS('Product benefit & adoption'!$G$4=\"ALL\",'Product benefit & adoption'!AU38*'Product benefit & adoption'!$P38/1000000,'Product benefit & adoption'!$G$4=\"2020-25\",'Product benefit & adoption'!AU38*'Product benefit & adoption'!$N38/1000000,'Product benefit & adoption'!$G$4=\"2015-20\",'Product benefit & adoption'!AU38*'Product benefit & adoption'!$L38/1000000)","v":0},{"$f":"_xlfn.IFS('Product benefit & adoption'!$G$4=\"ALL\",'Product benefit & adoption'!AV38*'Product benefit & adoption'!$P38/1000000,'Product benefit & adoption'!$G$4=\"2020-25\",'Product benefit & adoption'!AV38*'Product benefit & adoption'!$N38/1000000,'Product benefit & adoption'!$G$4=\"2015-20\",'Product benefit & adoption'!AV38*'Product benefit & adoption'!$L38/1000000)","v":0},{"$f":"_xlfn.IFS('Product benefit & adoption'!$G$4=\"ALL\",'Product benefit & adoption'!AW38*'Product benefit & adoption'!$P38/1000000,'Product benefit & adoption'!$G$4=\"2020-25\",'Product benefit & adoption'!AW38*'Product benefit & adoption'!$N38/1000000,'Product benefit & adoption'!$G$4=\"2015-20\",'Product benefit & adoption'!AW38*'Product benefit & adoption'!$L38/1000000)","v":0},{"$f":"_xlfn.IFS('Product benefit & adoption'!$G$4=\"ALL\",'Product benefit & adoption'!AX38*'Product benefit & adoption'!$P38/1000000,'Product benefit & adoption'!$G$4=\"2020-25\",'Product benefit & adoption'!AX38*'Product benefit & adoption'!$N38/1000000,'Product benefit & adoption'!$G$4=\"2015-20\",'Product benefit & adoption'!AX38*'Product benefit & adoption'!$L38/1000000)","v":0},{"$f":"_xlfn.IFS('Product benefit & adoption'!$G$4=\"ALL\",'Product benefit & adoption'!AY38*'Product benefit & adoption'!$P38/1000000,'Product benefit & adoption'!$G$4=\"2020-25\",'Product benefit & adoption'!AY38*'Product benefit & adoption'!$N38/1000000,'Product benefit & adoption'!$G$4=\"2015-20\",'Product benefit & adoption'!AY38*'Product benefit & adoption'!$L38/1000000)","v":0},{"$f":"_xlfn.IFS('Product benefit & adoption'!$G$4=\"ALL\",'Product benefit & adoption'!AZ38*'Product benefit & adoption'!$P38/1000000,'Product benefit & adoption'!$G$4=\"2020-25\",'Product benefit & adoption'!AZ38*'Product benefit & adoption'!$N38/1000000,'Product benefit & adoption'!$G$4=\"2015-20\",'Product benefit & adoption'!AZ38*'Product benefit & adoption'!$L38/1000000)","v":0},{"$f":"_xlfn.IFS('Product benefit & adoption'!$G$4=\"ALL\",'Product benefit & adoption'!BA38*'Product benefit & adoption'!$P38/1000000,'Product benefit & adoption'!$G$4=\"2020-25\",'Product benefit & adoption'!BA38*'Product benefit & adoption'!$N38/1000000,'Product benefit & adoption'!$G$4=\"2015-20\",'Product benefit & adoption'!BA38*'Product benefit & adoption'!$L38/1000000)","v":0},{"$f":"_xlfn.IFS('Product benefit & adoption'!$G$4=\"ALL\",'Product benefit & adoption'!BB38*'Product benefit & adoption'!$P38/1000000,'Product benefit & adoption'!$G$4=\"2020-25\",'Product benefit & adoption'!BB38*'Product benefit & adoption'!$N38/1000000,'Product benefit & adoption'!$G$4=\"2015-20\",'Product benefit & adoption'!BB38*'Product benefit & adoption'!$L38/1000000)","v":0},{"$f":"_xlfn.IFS('Product benefit & adoption'!$G$4=\"ALL\",'Product benefit & adoption'!BC38*'Product benefit & adoption'!$P38/1000000,'Product benefit & adoption'!$G$4=\"2020-25\",'Product benefit & adoption'!BC38*'Product benefit & adoption'!$N38/1000000,'Product benefit & adoption'!$G$4=\"2015-20\",'Product benefit & adoption'!BC38*'Product benefit & adoption'!$L38/1000000)","v":0},{"$f":"_xlfn.IFS('Product benefit & adoption'!$G$4=\"ALL\",'Product benefit & adoption'!BD38*'Product benefit & adoption'!$P38/1000000,'Product benefit & adoption'!$G$4=\"2020-25\",'Product benefit & adoption'!BD38*'Product benefit & adoption'!$N38/1000000,'Product benefit & adoption'!$G$4=\"2015-20\",'Product benefit & adoption'!BD38*'Product benefit & adoption'!$L38/1000000)","v":0}]
[null,29,{"$f":"IF('Product benefit & adoption'!D39=\"\",\"\",'Product benefit & adoption'!D39)","v":""},{"$f":"IF('Product benefit & adoption'!F39=\"\",\"\",'Product benefit & adoption'!F39)","v":""},0,{"$f":"_xlfn.IFS('Product benefit & adoption'!$G$4=\"ALL\",'Product benefit & adoption'!AA39*'Product benefit & adoption'!$P39/1000000,'Product benefit & adoption'!$G$4=\"2020-25\",'Product benefit & adoption'!AA39*'Product benefit & adoption'!$N39/1000000,'Product benefit & adoption'!$G$4=\"2015-20\",'Product benefit & adoption'!AA39*'Product benefit & adoption'!$L39/1000000)","v":0},{"$f":"_xlfn.IFS('Product benefit & adoption'!$G$4=\"ALL\",'Product benefit & adoption'!AB39*'Product benefit & adoption'!$P39/1000000,'Product benefit & adoption'!$G$4=\"2020-25\",'Product benefit & adoption'!AB39*'Product benefit & adoption'!$N39/1000000,'Product benefit & adoption'!$G$4=\"2015-20\",'Product benefit & adoption'!AB39*'Product benefit & adoption'!$L39/1000000)","v":0},{"$f":"_xlfn.IFS('Product benefit & adoption'!$G$4=\"ALL\",'Product benefit & adoption'!AC39*'Product benefit & adoption'!$P39/1000000,'Product benefit & adoption'!$G$4=\"2020-25\",'Product benefit & adoption'!AC39*'Product benefit & adoption'!$N39/1000000,'Product benefit & adoption'!$G$4=\"2015-20\",'Product benefit & adoption'!AC39*'Product benefit & adoption'!$L39/1000000)","v":0},{"$f":"_xlfn.IFS('Product benefit & adoption'!$G$4=\"ALL\",'Product benefit & adoption'!AD39*'Product benefit & adoption'!$P39/1000000,'Product benefit & adoption'!$G$4=\"2020-25\",'Product benefit & adoption'!AD39*'Product benefit & adoption'!$N39/1000000,'Product benefit & adoption'!$G$4=\"2015-20\",'Product benefit & adoption'!AD39*'Product benefit & adoption'!$L39/1000000)","v":0},{"$f":"_xlfn.IFS('Product benefit & adoption'!$G$4=\"ALL\",'Product benefit & adoption'!AE39*'Product benefit & adoption'!$P39/1000000,'Product benefit & adoption'!$G$4=\"2020-25\",'Product benefit & adoption'!AE39*'Product benefit & adoption'!$N39/1000000,'Product benefit & adoption'!$G$4=\"2015-20\",'Product benefit & adoption'!AE39*'Product benefit & adoption'!$L39/1000000)","v":0},{"$f":"_xlfn.IFS('Product benefit & adoption'!$G$4=\"ALL\",'Product benefit & adoption'!AF39*'Product benefit & adoption'!$P39/1000000,'Product benefit & adoption'!$G$4=\"2020-25\",'Product benefit & adoption'!AF39*'Product benefit & adoption'!$N39/1000000,'Product benefit & adoption'!$G$4=\"2015-20\",'Product benefit & adoption'!AF39*'Product benefit & adoption'!$L39/1000000)","v":0},{"$f":"_xlfn.IFS('Product benefit & adoption'!$G$4=\"ALL\",'Product benefit & adoption'!AG39*'Product benefit & adoption'!$P39/1000000,'Product benefit & adoption'!$G$4=\"2020-25\",'Product benefit & adoption'!AG39*'Product benefit & adoption'!$N39/1000000,'Product benefit & adoption'!$G$4=\"2015-20\",'Product benefit & adoption'!AG39*'Product benefit & adoption'!$L39/1000000)","v":0},{"$f":"_xlfn.IFS('Product benefit & adoption'!$G$4=\"ALL\",'Product benefit & adoption'!AH39*'Product benefit & adoption'!$P39/1000000,'Product benefit & adoption'!$G$4=\"2020-25\",'Product benefit & adoption'!AH39*'Product benefit & adoption'!$N39/1000000,'Product benefit & adoption'!$G$4=\"2015-20\",'Product benefit & adoption'!AH39*'Product benefit & adoption'!$L39/1000000)","v":0},{"$f":"_xlfn.IFS('Product benefit & adoption'!$G$4=\"ALL\",'Product benefit & adoption'!AI39*'Product benefit & adoption'!$P39/1000000,'Product benefit & adoption'!$G$4=\"2020-25\",'Product benefit & adoption'!AI39*'Product benefit & adoption'!$N39/1000000,'Product benefit & adoption'!$G$4=\"2015-20\",'Product benefit & adoption'!AI39*'Product benefit & adoption'!$L39/1000000)","v":0},{"$f":"_xlfn.IFS('Product benefit & adoption'!$G$4=\"ALL\",'Product benefit & adoption'!AJ39*'Product benefit & adoption'!$P39/1000000,'Product benefit & adoption'!$G$4=\"2020-25\",'Product benefit & adoption'!AJ39*'Product benefit & adoption'!$N39/1000000,'Product benefit & adoption'!$G$4=\"2015-20\",'Product benefit & adoption'!AJ39*'Product benefit & adoption'!$L39/1000000)","v":0},{"$f":"_xlfn.IFS('Product benefit & adoption'!$G$4=\"ALL\",'Product benefit & adoption'!AK39*'Product benefit & adoption'!$P39/1000000,'Product benefit & adoption'!$G$4=\"2020-25\",'Product benefit & adoption'!AK39*'Product benefit & adoption'!$N39/1000000,'Product benefit & adoption'!$G$4=\"2015-20\",'Product benefit & adoption'!AK39*'Product benefit & adoption'!$L39/1000000)","v":0},{"$f":"_xlfn.IFS('Product benefit & adoption'!$G$4=\"ALL\",'Product benefit & adoption'!AL39*'Product benefit & adoption'!$P39/1000000,'Product benefit & adoption'!$G$4=\"2020-25\",'Product benefit & adoption'!AL39*'Product benefit & adoption'!$N39/1000000,'Product benefit & adoption'!$G$4=\"2015-20\",'Product benefit & adoption'!AL39*'Product benefit & adoption'!$L39/1000000)","v":0},{"$f":"_xlfn.IFS('Product benefit & adoption'!$G$4=\"ALL\",'Product benefit & adoption'!AM39*'Product benefit & adoption'!$P39/1000000,'Product benefit & adoption'!$G$4=\"2020-25\",'Product benefit & adoption'!AM39*'Product benefit & adoption'!$N39/1000000,'Product benefit & adoption'!$G$4=\"2015-20\",'Product benefit & adoption'!AM39*'Product benefit & adoption'!$L39/1000000)","v":0},{"$f":"_xlfn.IFS('Product benefit & adoption'!$G$4=\"ALL\",'Product benefit & adoption'!AN39*'Product benefit & adoption'!$P39/1000000,'Product benefit & adoption'!$G$4=\"2020-25\",'Product benefit & adoption'!AN39*'Product benefit & adoption'!$N39/1000000,'Product benefit & adoption'!$G$4=\"2015-20\",'Product benefit & adoption'!AN39*'Product benefit & adoption'!$L39/1000000)","v":0},{"$f":"_xlfn.IFS('Product benefit & adoption'!$G$4=\"ALL\",'Product benefit & adoption'!AO39*'Product benefit & adoption'!$P39/1000000,'Product benefit & adoption'!$G$4=\"2020-25\",'Product benefit & adoption'!AO39*'Product benefit & adoption'!$N39/1000000,'Product benefit & adoption'!$G$4=\"2015-20\",'Product benefit & adoption'!AO39*'Product benefit & adoption'!$L39/1000000)","v":0},{"$f":"_xlfn.IFS('Product benefit & adoption'!$G$4=\"ALL\",'Product benefit & adoption'!AP39*'Product benefit & adoption'!$P39/1000000,'Product benefit & adoption'!$G$4=\"2020-25\",'Product benefit & adoption'!AP39*'Product benefit & adoption'!$N39/1000000,'Product benefit & adoption'!$G$4=\"2015-20\",'Product benefit & adoption'!AP39*'Product benefit & adoption'!$L39/1000000)","v":0},{"$f":"_xlfn.IFS('Product benefit & adoption'!$G$4=\"ALL\",'Product benefit & adoption'!AQ39*'Product benefit & adoption'!$P39/1000000,'Product benefit & adoption'!$G$4=\"2020-25\",'Product benefit & adoption'!AQ39*'Product benefit & adoption'!$N39/1000000,'Product benefit & adoption'!$G$4=\"2015-20\",'Product benefit & adoption'!AQ39*'Product benefit & adoption'!$L39/1000000)","v":0},{"$f":"_xlfn.IFS('Product benefit & adoption'!$G$4=\"ALL\",'Product benefit & adoption'!AR39*'Product benefit & adoption'!$P39/1000000,'Product benefit & adoption'!$G$4=\"2020-25\",'Product benefit & adoption'!AR39*'Product benefit & adoption'!$N39/1000000,'Product benefit & adoption'!$G$4=\"2015-20\",'Product benefit & adoption'!AR39*'Product benefit & adoption'!$L39/1000000)","v":0},{"$f":"_xlfn.IFS('Product benefit & adoption'!$G$4=\"ALL\",'Product benefit & adoption'!AS39*'Product benefit & adoption'!$P39/1000000,'Product benefit & adoption'!$G$4=\"2020-25\",'Product benefit & adoption'!AS39*'Product benefit & adoption'!$N39/1000000,'Product benefit & adoption'!$G$4=\"2015-20\",'Product benefit & adoption'!AS39*'Product benefit & adoption'!$L39/1000000)","v":0},{"$f":"_xlfn.IFS('Product benefit & adoption'!$G$4=\"ALL\",'Product benefit & adoption'!AT39*'Product benefit & adoption'!$P39/1000000,'Product benefit & adoption'!$G$4=\"2020-25\",'Product benefit & adoption'!AT39*'Product benefit & adoption'!$N39/1000000,'Product benefit & adoption'!$G$4=\"2015-20\",'Product benefit & adoption'!AT39*'Product benefit & adoption'!$L39/1000000)","v":0},{"$f":"_xlfn.IFS('Product benefit & adoption'!$G$4=\"ALL\",'Product benefit & adoption'!AU39*'Product benefit & adoption'!$P39/1000000,'Product benefit & adoption'!$G$4=\"2020-25\",'Product benefit & adoption'!AU39*'Product benefit & adoption'!$N39/1000000,'Product benefit & adoption'!$G$4=\"2015-20\",'Product benefit & adoption'!AU39*'Product benefit & adoption'!$L39/1000000)","v":0},{"$f":"_xlfn.IFS('Product benefit & adoption'!$G$4=\"ALL\",'Product benefit & adoption'!AV39*'Product benefit & adoption'!$P39/1000000,'Product benefit & adoption'!$G$4=\"2020-25\",'Product benefit & adoption'!AV39*'Product benefit & adoption'!$N39/1000000,'Product benefit & adoption'!$G$4=\"2015-20\",'Product benefit & adoption'!AV39*'Product benefit & adoption'!$L39/1000000)","v":0},{"$f":"_xlfn.IFS('Product benefit & adoption'!$G$4=\"ALL\",'Product benefit & adoption'!AW39*'Product benefit & adoption'!$P39/1000000,'Product benefit & adoption'!$G$4=\"2020-25\",'Product benefit & adoption'!AW39*'Product benefit & adoption'!$N39/1000000,'Product benefit & adoption'!$G$4=\"2015-20\",'Product benefit & adoption'!AW39*'Product benefit & adoption'!$L39/1000000)","v":0},{"$f":"_xlfn.IFS('Product benefit & adoption'!$G$4=\"ALL\",'Product benefit & adoption'!AX39*'Product benefit & adoption'!$P39/1000000,'Product benefit & adoption'!$G$4=\"2020-25\",'Product benefit & adoption'!AX39*'Product benefit & adoption'!$N39/1000000,'Product benefit & adoption'!$G$4=\"2015-20\",'Product benefit & adoption'!AX39*'Product benefit & adoption'!$L39/1000000)","v":0},{"$f":"_xlfn.IFS('Product benefit & adoption'!$G$4=\"ALL\",'Product benefit & adoption'!AY39*'Product benefit & adoption'!$P39/1000000,'Product benefit & adoption'!$G$4=\"2020-25\",'Product benefit & adoption'!AY39*'Product benefit & adoption'!$N39/1000000,'Product benefit & adoption'!$G$4=\"2015-20\",'Product benefit & adoption'!AY39*'Product benefit & adoption'!$L39/1000000)","v":0},{"$f":"_xlfn.IFS('Product benefit & adoption'!$G$4=\"ALL\",'Product benefit & adoption'!AZ39*'Product benefit & adoption'!$P39/1000000,'Product benefit & adoption'!$G$4=\"2020-25\",'Product benefit & adoption'!AZ39*'Product benefit & adoption'!$N39/1000000,'Product benefit & adoption'!$G$4=\"2015-20\",'Product benefit & adoption'!AZ39*'Product benefit & adoption'!$L39/1000000)","v":0},{"$f":"_xlfn.IFS('Product benefit & adoption'!$G$4=\"ALL\",'Product benefit & adoption'!BA39*'Product benefit & adoption'!$P39/1000000,'Product benefit & adoption'!$G$4=\"2020-25\",'Product benefit & adoption'!BA39*'Product benefit & adoption'!$N39/1000000,'Product benefit & adoption'!$G$4=\"2015-20\",'Product benefit & adoption'!BA39*'Product benefit & adoption'!$L39/1000000)","v":0},{"$f":"_xlfn.IFS('Product benefit & adoption'!$G$4=\"ALL\",'Product benefit & adoption'!BB39*'Product benefit & adoption'!$P39/1000000,'Product benefit & adoption'!$G$4=\"2020-25\",'Product benefit & adoption'!BB39*'Product benefit & adoption'!$N39/1000000,'Product benefit & adoption'!$G$4=\"2015-20\",'Product benefit & adoption'!BB39*'Product benefit & adoption'!$L39/1000000)","v":0},{"$f":"_xlfn.IFS('Product benefit & adoption'!$G$4=\"ALL\",'Product benefit & adoption'!BC39*'Product benefit & adoption'!$P39/1000000,'Product benefit & adoption'!$G$4=\"2020-25\",'Product benefit & adoption'!BC39*'Product benefit & adoption'!$N39/1000000,'Product benefit & adoption'!$G$4=\"2015-20\",'Product benefit & adoption'!BC39*'Product benefit & adoption'!$L39/1000000)","v":0},{"$f":"_xlfn.IFS('Product benefit & adoption'!$G$4=\"ALL\",'Product benefit & adoption'!BD39*'Product benefit & adoption'!$P39/1000000,'Product benefit & adoption'!$G$4=\"2020-25\",'Product benefit & adoption'!BD39*'Product benefit & adoption'!$N39/1000000,'Product benefit & adoption'!$G$4=\"2015-20\",'Product benefit & adoption'!BD39*'Product benefit & adoption'!$L39/1000000)","v":0}]
[null,30,{"$f":"IF('Product benefit & adoption'!D40=\"\",\"\",'Product benefit & adoption'!D40)","v":""},{"$f":"IF('Product benefit & adoption'!F40=\"\",\"\",'Product benefit & adoption'!F40)","v":""},0,{"$f":"_xlfn.IFS('Product benefit & adoption'!$G$4=\"ALL\",'Product benefit & adoption'!AA40*'Product benefit & adoption'!$P40/1000000,'Product benefit & adoption'!$G$4=\"2020-25\",'Product benefit & adoption'!AA40*'Product benefit & adoption'!$N40/1000000,'Product benefit & adoption'!$G$4=\"2015-20\",'Product benefit & adoption'!AA40*'Product benefit & adoption'!$L40/1000000)","v":0},{"$f":"_xlfn.IFS('Product benefit & adoption'!$G$4=\"ALL\",'Product benefit & adoption'!AB40*'Product benefit & adoption'!$P40/1000000,'Product benefit & adoption'!$G$4=\"2020-25\",'Product benefit & adoption'!AB40*'Product benefit & adoption'!$N40/1000000,'Product benefit & adoption'!$G$4=\"2015-20\",'Product benefit & adoption'!AB40*'Product benefit & adoption'!$L40/1000000)","v":0},{"$f":"_xlfn.IFS('Product benefit & adoption'!$G$4=\"ALL\",'Product benefit & adoption'!AC40*'Product benefit & adoption'!$P40/1000000,'Product benefit & adoption'!$G$4=\"2020-25\",'Product benefit & adoption'!AC40*'Product benefit & adoption'!$N40/1000000,'Product benefit & adoption'!$G$4=\"2015-20\",'Product benefit & adoption'!AC40*'Product benefit & adoption'!$L40/1000000)","v":0},{"$f":"_xlfn.IFS('Product benefit & adoption'!$G$4=\"ALL\",'Product benefit & adoption'!AD40*'Product benefit & adoption'!$P40/1000000,'Product benefit & adoption'!$G$4=\"2020-25\",'Product benefit & adoption'!AD40*'Product benefit & adoption'!$N40/1000000,'Product benefit & adoption'!$G$4=\"2015-20\",'Product benefit & adoption'!AD40*'Product benefit & adoption'!$L40/1000000)","v":0},{"$f":"_xlfn.IFS('Product benefit & adoption'!$G$4=\"ALL\",'Product benefit & adoption'!AE40*'Product benefit & adoption'!$P40/1000000,'Product benefit & adoption'!$G$4=\"2020-25\",'Product benefit & adoption'!AE40*'Product benefit & adoption'!$N40/1000000,'Product benefit & adoption'!$G$4=\"2015-20\",'Product benefit & adoption'!AE40*'Product benefit & adoption'!$L40/1000000)","v":0},{"$f":"_xlfn.IFS('Product benefit & adoption'!$G$4=\"ALL\",'Product benefit & adoption'!AF40*'Product benefit & adoption'!$P40/1000000,'Product benefit & adoption'!$G$4=\"2020-25\",'Product benefit & adoption'!AF40*'Product benefit & adoption'!$N40/1000000,'Product benefit & adoption'!$G$4=\"2015-20\",'Product benefit & adoption'!AF40*'Product benefit & adoption'!$L40/1000000)","v":0},{"$f":"_xlfn.IFS('Product benefit & adoption'!$G$4=\"ALL\",'Product benefit & adoption'!AG40*'Product benefit & adoption'!$P40/1000000,'Product benefit & adoption'!$G$4=\"2020-25\",'Product benefit & adoption'!AG40*'Product benefit & adoption'!$N40/1000000,'Product benefit & adoption'!$G$4=\"2015-20\",'Product benefit & adoption'!AG40*'Product benefit & adoption'!$L40/1000000)","v":0},{"$f":"_xlfn.IFS('Product benefit & adoption'!$G$4=\"ALL\",'Product benefit & adoption'!AH40*'Product benefit & adoption'!$P40/1000000,'Product benefit & adoption'!$G$4=\"2020-25\",'Product benefit & adoption'!AH40*'Product benefit & adoption'!$N40/1000000,'Product benefit & adoption'!$G$4=\"2015-20\",'Product benefit & adoption'!AH40*'Product benefit & adoption'!$L40/1000000)","v":0},{"$f":"_xlfn.IFS('Product benefit & adoption'!$G$4=\"ALL\",'Product benefit & adoption'!AI40*'Product benefit & adoption'!$P40/1000000,'Product benefit & adoption'!$G$4=\"2020-25\",'Product benefit & adoption'!AI40*'Product benefit & adoption'!$N40/1000000,'Product benefit & adoption'!$G$4=\"2015-20\",'Product benefit & adoption'!AI40*'Product benefit & adoption'!$L40/1000000)","v":0},{"$f":"_xlfn.IFS('Product benefit & adoption'!$G$4=\"ALL\",'Product benefit & adoption'!AJ40*'Product benefit & adoption'!$P40/1000000,'Product benefit & adoption'!$G$4=\"2020-25\",'Product benefit & adoption'!AJ40*'Product benefit & adoption'!$N40/1000000,'Product benefit & adoption'!$G$4=\"2015-20\",'Product benefit & adoption'!AJ40*'Product benefit & adoption'!$L40/1000000)","v":0},{"$f":"_xlfn.IFS('Product benefit & adoption'!$G$4=\"ALL\",'Product benefit & adoption'!AK40*'Product benefit & adoption'!$P40/1000000,'Product benefit & adoption'!$G$4=\"2020-25\",'Product benefit & adoption'!AK40*'Product benefit & adoption'!$N40/1000000,'Product benefit & adoption'!$G$4=\"2015-20\",'Product benefit & adoption'!AK40*'Product benefit & adoption'!$L40/1000000)","v":0},{"$f":"_xlfn.IFS('Product benefit & adoption'!$G$4=\"ALL\",'Product benefit & adoption'!AL40*'Product benefit & adoption'!$P40/1000000,'Product benefit & adoption'!$G$4=\"2020-25\",'Product benefit & adoption'!AL40*'Product benefit & adoption'!$N40/1000000,'Product benefit & adoption'!$G$4=\"2015-20\",'Product benefit & adoption'!AL40*'Product benefit & adoption'!$L40/1000000)","v":0},{"$f":"_xlfn.IFS('Product benefit & adoption'!$G$4=\"ALL\",'Product benefit & adoption'!AM40*'Product benefit & adoption'!$P40/1000000,'Product benefit & adoption'!$G$4=\"2020-25\",'Product benefit & adoption'!AM40*'Product benefit & adoption'!$N40/1000000,'Product benefit & adoption'!$G$4=\"2015-20\",'Product benefit & adoption'!AM40*'Product benefit & adoption'!$L40/1000000)","v":0},{"$f":"_xlfn.IFS('Product benefit & adoption'!$G$4=\"ALL\",'Product benefit & adoption'!AN40*'Product benefit & adoption'!$P40/1000000,'Product benefit & adoption'!$G$4=\"2020-25\",'Product benefit & adoption'!AN40*'Product benefit & adoption'!$N40/1000000,'Product benefit & adoption'!$G$4=\"2015-20\",'Product benefit & adoption'!AN40*'Product benefit & adoption'!$L40/1000000)","v":0},{"$f":"_xlfn.IFS('Product benefit & adoption'!$G$4=\"ALL\",'Product benefit & adoption'!AO40*'Product benefit & adoption'!$P40/1000000,'Product benefit & adoption'!$G$4=\"2020-25\",'Product benefit & adoption'!AO40*'Product benefit & adoption'!$N40/1000000,'Product benefit & adoption'!$G$4=\"2015-20\",'Product benefit & adoption'!AO40*'Product benefit & adoption'!$L40/1000000)","v":0},{"$f":"_xlfn.IFS('Product benefit & adoption'!$G$4=\"ALL\",'Product benefit & adoption'!AP40*'Product benefit & adoption'!$P40/1000000,'Product benefit & adoption'!$G$4=\"2020-25\",'Product benefit & adoption'!AP40*'Product benefit & adoption'!$N40/1000000,'Product benefit & adoption'!$G$4=\"2015-20\",'Product benefit & adoption'!AP40*'Product benefit & adoption'!$L40/1000000)","v":0},{"$f":"_xlfn.IFS('Product benefit & adoption'!$G$4=\"ALL\",'Product benefit & adoption'!AQ40*'Product benefit & adoption'!$P40/1000000,'Product benefit & adoption'!$G$4=\"2020-25\",'Product benefit & adoption'!AQ40*'Product benefit & adoption'!$N40/1000000,'Product benefit & adoption'!$G$4=\"2015-20\",'Product benefit & adoption'!AQ40*'Product benefit & adoption'!$L40/1000000)","v":0},{"$f":"_xlfn.IFS('Product benefit & adoption'!$G$4=\"ALL\",'Product benefit & adoption'!AR40*'Product benefit & adoption'!$P40/1000000,'Product benefit & adoption'!$G$4=\"2020-25\",'Product benefit & adoption'!AR40*'Product benefit & adoption'!$N40/1000000,'Product benefit & adoption'!$G$4=\"2015-20\",'Product benefit & adoption'!AR40*'Product benefit & adoption'!$L40/1000000)","v":0},{"$f":"_xlfn.IFS('Product benefit & adoption'!$G$4=\"ALL\",'Product benefit & adoption'!AS40*'Product benefit & adoption'!$P40/1000000,'Product benefit & adoption'!$G$4=\"2020-25\",'Product benefit & adoption'!AS40*'Product benefit & adoption'!$N40/1000000,'Product benefit & adoption'!$G$4=\"2015-20\",'Product benefit & adoption'!AS40*'Product benefit & adoption'!$L40/1000000)","v":0},{"$f":"_xlfn.IFS('Product benefit & adoption'!$G$4=\"ALL\",'Product benefit & adoption'!AT40*'Product benefit & adoption'!$P40/1000000,'Product benefit & adoption'!$G$4=\"2020-25\",'Product benefit & adoption'!AT40*'Product benefit & adoption'!$N40/1000000,'Product benefit & adoption'!$G$4=\"2015-20\",'Product benefit & adoption'!AT40*'Product benefit & adoption'!$L40/1000000)","v":0},{"$f":"_xlfn.IFS('Product benefit & adoption'!$G$4=\"ALL\",'Product benefit & adoption'!AU40*'Product benefit & adoption'!$P40/1000000,'Product benefit & adoption'!$G$4=\"2020-25\",'Product benefit & adoption'!AU40*'Product benefit & adoption'!$N40/1000000,'Product benefit & adoption'!$G$4=\"2015-20\",'Product benefit & adoption'!AU40*'Product benefit & adoption'!$L40/1000000)","v":0},{"$f":"_xlfn.IFS('Product benefit & adoption'!$G$4=\"ALL\",'Product benefit & adoption'!AV40*'Product benefit & adoption'!$P40/1000000,'Product benefit & adoption'!$G$4=\"2020-25\",'Product benefit & adoption'!AV40*'Product benefit & adoption'!$N40/1000000,'Product benefit & adoption'!$G$4=\"2015-20\",'Product benefit & adoption'!AV40*'Product benefit & adoption'!$L40/1000000)","v":0},{"$f":"_xlfn.IFS('Product benefit & adoption'!$G$4=\"ALL\",'Product benefit & adoption'!AW40*'Product benefit & adoption'!$P40/1000000,'Product benefit & adoption'!$G$4=\"2020-25\",'Product benefit & adoption'!AW40*'Product benefit & adoption'!$N40/1000000,'Product benefit & adoption'!$G$4=\"2015-20\",'Product benefit & adoption'!AW40*'Product benefit & adoption'!$L40/1000000)","v":0},{"$f":"_xlfn.IFS('Product benefit & adoption'!$G$4=\"ALL\",'Product benefit & adoption'!AX40*'Product benefit & adoption'!$P40/1000000,'Product benefit & adoption'!$G$4=\"2020-25\",'Product benefit & adoption'!AX40*'Product benefit & adoption'!$N40/1000000,'Product benefit & adoption'!$G$4=\"2015-20\",'Product benefit & adoption'!AX40*'Product benefit & adoption'!$L40/1000000)","v":0},{"$f":"_xlfn.IFS('Product benefit & adoption'!$G$4=\"ALL\",'Product benefit & adoption'!AY40*'Product benefit & adoption'!$P40/1000000,'Product benefit & adoption'!$G$4=\"2020-25\",'Product benefit & adoption'!AY40*'Product benefit & adoption'!$N40/1000000,'Product benefit & adoption'!$G$4=\"2015-20\",'Product benefit & adoption'!AY40*'Product benefit & adoption'!$L40/1000000)","v":0},{"$f":"_xlfn.IFS('Product benefit & adoption'!$G$4=\"ALL\",'Product benefit & adoption'!AZ40*'Product benefit & adoption'!$P40/1000000,'Product benefit & adoption'!$G$4=\"2020-25\",'Product benefit & adoption'!AZ40*'Product benefit & adoption'!$N40/1000000,'Product benefit & adoption'!$G$4=\"2015-20\",'Product benefit & adoption'!AZ40*'Product benefit & adoption'!$L40/1000000)","v":0},{"$f":"_xlfn.IFS('Product benefit & adoption'!$G$4=\"ALL\",'Product benefit & adoption'!BA40*'Product benefit & adoption'!$P40/1000000,'Product benefit & adoption'!$G$4=\"2020-25\",'Product benefit & adoption'!BA40*'Product benefit & adoption'!$N40/1000000,'Product benefit & adoption'!$G$4=\"2015-20\",'Product benefit & adoption'!BA40*'Product benefit & adoption'!$L40/1000000)","v":0},{"$f":"_xlfn.IFS('Product benefit & adoption'!$G$4=\"ALL\",'Product benefit & adoption'!BB40*'Product benefit & adoption'!$P40/1000000,'Product benefit & adoption'!$G$4=\"2020-25\",'Product benefit & adoption'!BB40*'Product benefit & adoption'!$N40/1000000,'Product benefit & adoption'!$G$4=\"2015-20\",'Product benefit & adoption'!BB40*'Product benefit & adoption'!$L40/1000000)","v":0},{"$f":"_xlfn.IFS('Product benefit & adoption'!$G$4=\"ALL\",'Product benefit & adoption'!BC40*'Product benefit & adoption'!$P40/1000000,'Product benefit & adoption'!$G$4=\"2020-25\",'Product benefit & adoption'!BC40*'Product benefit & adoption'!$N40/1000000,'Product benefit & adoption'!$G$4=\"2015-20\",'Product benefit & adoption'!BC40*'Product benefit & adoption'!$L40/1000000)","v":0},{"$f":"_xlfn.IFS('Product benefit & adoption'!$G$4=\"ALL\",'Product benefit & adoption'!BD40*'Product benefit & adoption'!$P40/1000000,'Product benefit & adoption'!$G$4=\"2020-25\",'Product benefit & adoption'!BD40*'Product benefit & adoption'!$N40/1000000,'Product benefit & adoption'!$G$4=\"2015-20\",'Product benefit & adoption'!BD40*'Product benefit & adoption'!$L40/1000000)","v":0}]
[null,31,{"$f":"IF('Product benefit & adoption'!D41=\"\",\"\",'Product benefit & adoption'!D41)","v":""},{"$f":"IF('Product benefit & adoption'!F41=\"\",\"\",'Product benefit & adoption'!F41)","v":""},0,{"$f":"_xlfn.IFS('Product benefit & adoption'!$G$4=\"ALL\",'Product benefit & adoption'!AA41*'Product benefit & adoption'!$P41/1000000,'Product benefit & adoption'!$G$4=\"2020-25\",'Product benefit & adoption'!AA41*'Product benefit & adoption'!$N41/1000000,'Product benefit & adoption'!$G$4=\"2015-20\",'Product benefit & adoption'!AA41*'Product benefit & adoption'!$L41/1000000)","v":0},{"$f":"_xlfn.IFS('Product benefit & adoption'!$G$4=\"ALL\",'Product benefit & adoption'!AB41*'Product benefit & adoption'!$P41/1000000,'Product benefit & adoption'!$G$4=\"2020-25\",'Product benefit & adoption'!AB41*'Product benefit & adoption'!$N41/1000000,'Product benefit & adoption'!$G$4=\"2015-20\",'Product benefit & adoption'!AB41*'Product benefit & adoption'!$L41/1000000)","v":0},{"$f":"_xlfn.IFS('Product benefit & adoption'!$G$4=\"ALL\",'Product benefit & adoption'!AC41*'Product benefit & adoption'!$P41/1000000,'Product benefit & adoption'!$G$4=\"2020-25\",'Product benefit & adoption'!AC41*'Product benefit & adoption'!$N41/1000000,'Product benefit & adoption'!$G$4=\"2015-20\",'Product benefit & adoption'!AC41*'Product benefit & adoption'!$L41/1000000)","v":0},{"$f":"_xlfn.IFS('Product benefit & adoption'!$G$4=\"ALL\",'Product benefit & adoption'!AD41*'Product benefit & adoption'!$P41/1000000,'Product benefit & adoption'!$G$4=\"2020-25\",'Product benefit & adoption'!AD41*'Product benefit & adoption'!$N41/1000000,'Product benefit & adoption'!$G$4=\"2015-20\",'Product benefit & adoption'!AD41*'Product benefit & adoption'!$L41/1000000)","v":0},{"$f":"_xlfn.IFS('Product benefit & adoption'!$G$4=\"ALL\",'Product benefit & adoption'!AE41*'Product benefit & adoption'!$P41/1000000,'Product benefit & adoption'!$G$4=\"2020-25\",'Product benefit & adoption'!AE41*'Product benefit & adoption'!$N41/1000000,'Product benefit & adoption'!$G$4=\"2015-20\",'Product benefit & adoption'!AE41*'Product benefit & adoption'!$L41/1000000)","v":0},{"$f":"_xlfn.IFS('Product benefit & adoption'!$G$4=\"ALL\",'Product benefit & adoption'!AF41*'Product benefit & adoption'!$P41/1000000,'Product benefit & adoption'!$G$4=\"2020-25\",'Product benefit & adoption'!AF41*'Product benefit & adoption'!$N41/1000000,'Product benefit & adoption'!$G$4=\"2015-20\",'Product benefit & adoption'!AF41*'Product benefit & adoption'!$L41/1000000)","v":0},{"$f":"_xlfn.IFS('Product benefit & adoption'!$G$4=\"ALL\",'Product benefit & adoption'!AG41*'Product benefit & adoption'!$P41/1000000,'Product benefit & adoption'!$G$4=\"2020-25\",'Product benefit & adoption'!AG41*'Product benefit & adoption'!$N41/1000000,'Product benefit & adoption'!$G$4=\"2015-20\",'Product benefit & adoption'!AG41*'Product benefit & adoption'!$L41/1000000)","v":0},{"$f":"_xlfn.IFS('Product benefit & adoption'!$G$4=\"ALL\",'Product benefit & adoption'!AH41*'Product benefit & adoption'!$P41/1000000,'Product benefit & adoption'!$G$4=\"2020-25\",'Product benefit & adoption'!AH41*'Product benefit & adoption'!$N41/1000000,'Product benefit & adoption'!$G$4=\"2015-20\",'Product benefit & adoption'!AH41*'Product benefit & adoption'!$L41/1000000)","v":0},{"$f":"_xlfn.IFS('Product benefit & adoption'!$G$4=\"ALL\",'Product benefit & adoption'!AI41*'Product benefit & adoption'!$P41/1000000,'Product benefit & adoption'!$G$4=\"2020-25\",'Product benefit & adoption'!AI41*'Product benefit & adoption'!$N41/1000000,'Product benefit & adoption'!$G$4=\"2015-20\",'Product benefit & adoption'!AI41*'Product benefit & adoption'!$L41/1000000)","v":0},{"$f":"_xlfn.IFS('Product benefit & adoption'!$G$4=\"ALL\",'Product benefit & adoption'!AJ41*'Product benefit & adoption'!$P41/1000000,'Product benefit & adoption'!$G$4=\"2020-25\",'Product benefit & adoption'!AJ41*'Product benefit & adoption'!$N41/1000000,'Product benefit & adoption'!$G$4=\"2015-20\",'Product benefit & adoption'!AJ41*'Product benefit & adoption'!$L41/1000000)","v":0},{"$f":"_xlfn.IFS('Product benefit & adoption'!$G$4=\"ALL\",'Product benefit & adoption'!AK41*'Product benefit & adoption'!$P41/1000000,'Product benefit & adoption'!$G$4=\"2020-25\",'Product benefit & adoption'!AK41*'Product benefit & adoption'!$N41/1000000,'Product benefit & adoption'!$G$4=\"2015-20\",'Product benefit & adoption'!AK41*'Product benefit & adoption'!$L41/1000000)","v":0},{"$f":"_xlfn.IFS('Product benefit & adoption'!$G$4=\"ALL\",'Product benefit & adoption'!AL41*'Product benefit & adoption'!$P41/1000000,'Product benefit & adoption'!$G$4=\"2020-25\",'Product benefit & adoption'!AL41*'Product benefit & adoption'!$N41/1000000,'Product benefit & adoption'!$G$4=\"2015-20\",'Product benefit & adoption'!AL41*'Product benefit & adoption'!$L41/1000000)","v":0},{"$f":"_xlfn.IFS('Product benefit & adoption'!$G$4=\"ALL\",'Product benefit & adoption'!AM41*'Product benefit & adoption'!$P41/1000000,'Product benefit & adoption'!$G$4=\"2020-25\",'Product benefit & adoption'!AM41*'Product benefit & adoption'!$N41/1000000,'Product benefit & adoption'!$G$4=\"2015-20\",'Product benefit & adoption'!AM41*'Product benefit & adoption'!$L41/1000000)","v":0},{"$f":"_xlfn.IFS('Product benefit & adoption'!$G$4=\"ALL\",'Product benefit & adoption'!AN41*'Product benefit & adoption'!$P41/1000000,'Product benefit & adoption'!$G$4=\"2020-25\",'Product benefit & adoption'!AN41*'Product benefit & adoption'!$N41/1000000,'Product benefit & adoption'!$G$4=\"2015-20\",'Product benefit & adoption'!AN41*'Product benefit & adoption'!$L41/1000000)","v":0},{"$f":"_xlfn.IFS('Product benefit & adoption'!$G$4=\"ALL\",'Product benefit & adoption'!AO41*'Product benefit & adoption'!$P41/1000000,'Product benefit & adoption'!$G$4=\"2020-25\",'Product benefit & adoption'!AO41*'Product benefit & adoption'!$N41/1000000,'Product benefit & adoption'!$G$4=\"2015-20\",'Product benefit & adoption'!AO41*'Product benefit & adoption'!$L41/1000000)","v":0},{"$f":"_xlfn.IFS('Product benefit & adoption'!$G$4=\"ALL\",'Product benefit & adoption'!AP41*'Product benefit & adoption'!$P41/1000000,'Product benefit & adoption'!$G$4=\"2020-25\",'Product benefit & adoption'!AP41*'Product benefit & adoption'!$N41/1000000,'Product benefit & adoption'!$G$4=\"2015-20\",'Product benefit & adoption'!AP41*'Product benefit & adoption'!$L41/1000000)","v":0},{"$f":"_xlfn.IFS('Product benefit & adoption'!$G$4=\"ALL\",'Product benefit & adoption'!AQ41*'Product benefit & adoption'!$P41/1000000,'Product benefit & adoption'!$G$4=\"2020-25\",'Product benefit & adoption'!AQ41*'Product benefit & adoption'!$N41/1000000,'Product benefit & adoption'!$G$4=\"2015-20\",'Product benefit & adoption'!AQ41*'Product benefit & adoption'!$L41/1000000)","v":0},{"$f":"_xlfn.IFS('Product benefit & adoption'!$G$4=\"ALL\",'Product benefit & adoption'!AR41*'Product benefit & adoption'!$P41/1000000,'Product benefit & adoption'!$G$4=\"2020-25\",'Product benefit & adoption'!AR41*'Product benefit & adoption'!$N41/1000000,'Product benefit & adoption'!$G$4=\"2015-20\",'Product benefit & adoption'!AR41*'Product benefit & adoption'!$L41/1000000)","v":0},{"$f":"_xlfn.IFS('Product benefit & adoption'!$G$4=\"ALL\",'Product benefit & adoption'!AS41*'Product benefit & adoption'!$P41/1000000,'Product benefit & adoption'!$G$4=\"2020-25\",'Product benefit & adoption'!AS41*'Product benefit & adoption'!$N41/1000000,'Product benefit & adoption'!$G$4=\"2015-20\",'Product benefit & adoption'!AS41*'Product benefit & adoption'!$L41/1000000)","v":0},{"$f":"_xlfn.IFS('Product benefit & adoption'!$G$4=\"ALL\",'Product benefit & adoption'!AT41*'Product benefit & adoption'!$P41/1000000,'Product benefit & adoption'!$G$4=\"2020-25\",'Product benefit & adoption'!AT41*'Product benefit & adoption'!$N41/1000000,'Product benefit & adoption'!$G$4=\"2015-20\",'Product benefit & adoption'!AT41*'Product benefit & adoption'!$L41/1000000)","v":0},{"$f":"_xlfn.IFS('Product benefit & adoption'!$G$4=\"ALL\",'Product benefit & adoption'!AU41*'Product benefit & adoption'!$P41/1000000,'Product benefit & adoption'!$G$4=\"2020-25\",'Product benefit & adoption'!AU41*'Product benefit & adoption'!$N41/1000000,'Product benefit & adoption'!$G$4=\"2015-20\",'Product benefit & adoption'!AU41*'Product benefit & adoption'!$L41/1000000)","v":0},{"$f":"_xlfn.IFS('Product benefit & adoption'!$G$4=\"ALL\",'Product benefit & adoption'!AV41*'Product benefit & adoption'!$P41/1000000,'Product benefit & adoption'!$G$4=\"2020-25\",'Product benefit & adoption'!AV41*'Product benefit & adoption'!$N41/1000000,'Product benefit & adoption'!$G$4=\"2015-20\",'Product benefit & adoption'!AV41*'Product benefit & adoption'!$L41/1000000)","v":0},{"$f":"_xlfn.IFS('Product benefit & adoption'!$G$4=\"ALL\",'Product benefit & adoption'!AW41*'Product benefit & adoption'!$P41/1000000,'Product benefit & adoption'!$G$4=\"2020-25\",'Product benefit & adoption'!AW41*'Product benefit & adoption'!$N41/1000000,'Product benefit & adoption'!$G$4=\"2015-20\",'Product benefit & adoption'!AW41*'Product benefit & adoption'!$L41/1000000)","v":0},{"$f":"_xlfn.IFS('Product benefit & adoption'!$G$4=\"ALL\",'Product benefit & adoption'!AX41*'Product benefit & adoption'!$P41/1000000,'Product benefit & adoption'!$G$4=\"2020-25\",'Product benefit & adoption'!AX41*'Product benefit & adoption'!$N41/1000000,'Product benefit & adoption'!$G$4=\"2015-20\",'Product benefit & adoption'!AX41*'Product benefit & adoption'!$L41/1000000)","v":0},{"$f":"_xlfn.IFS('Product benefit & adoption'!$G$4=\"ALL\",'Product benefit & adoption'!AY41*'Product benefit & adoption'!$P41/1000000,'Product benefit & adoption'!$G$4=\"2020-25\",'Product benefit & adoption'!AY41*'Product benefit & adoption'!$N41/1000000,'Product benefit & adoption'!$G$4=\"2015-20\",'Product benefit & adoption'!AY41*'Product benefit & adoption'!$L41/1000000)","v":0},{"$f":"_xlfn.IFS('Product benefit & adoption'!$G$4=\"ALL\",'Product benefit & adoption'!AZ41*'Product benefit & adoption'!$P41/1000000,'Product benefit & adoption'!$G$4=\"2020-25\",'Product benefit & adoption'!AZ41*'Product benefit & adoption'!$N41/1000000,'Product benefit & adoption'!$G$4=\"2015-20\",'Product benefit & adoption'!AZ41*'Product benefit & adoption'!$L41/1000000)","v":0},{"$f":"_xlfn.IFS('Product benefit & adoption'!$G$4=\"ALL\",'Product benefit & adoption'!BA41*'Product benefit & adoption'!$P41/1000000,'Product benefit & adoption'!$G$4=\"2020-25\",'Product benefit & adoption'!BA41*'Product benefit & adoption'!$N41/1000000,'Product benefit & adoption'!$G$4=\"2015-20\",'Product benefit & adoption'!BA41*'Product benefit & adoption'!$L41/1000000)","v":0},{"$f":"_xlfn.IFS('Product benefit & adoption'!$G$4=\"ALL\",'Product benefit & adoption'!BB41*'Product benefit & adoption'!$P41/1000000,'Product benefit & adoption'!$G$4=\"2020-25\",'Product benefit & adoption'!BB41*'Product benefit & adoption'!$N41/1000000,'Product benefit & adoption'!$G$4=\"2015-20\",'Product benefit & adoption'!BB41*'Product benefit & adoption'!$L41/1000000)","v":0},{"$f":"_xlfn.IFS('Product benefit & adoption'!$G$4=\"ALL\",'Product benefit & adoption'!BC41*'Product benefit & adoption'!$P41/1000000,'Product benefit & adoption'!$G$4=\"2020-25\",'Product benefit & adoption'!BC41*'Product benefit & adoption'!$N41/1000000,'Product benefit & adoption'!$G$4=\"2015-20\",'Product benefit & adoption'!BC41*'Product benefit & adoption'!$L41/1000000)","v":0},{"$f":"_xlfn.IFS('Product benefit & adoption'!$G$4=\"ALL\",'Product benefit & adoption'!BD41*'Product benefit & adoption'!$P41/1000000,'Product benefit & adoption'!$G$4=\"2020-25\",'Product benefit & adoption'!BD41*'Product benefit & adoption'!$N41/1000000,'Product benefit & adoption'!$G$4=\"2015-20\",'Product benefit & adoption'!BD41*'Product benefit & adoption'!$L41/1000000)","v":0}]
[null,32,{"$f":"IF('Product benefit & adoption'!D42=\"\",\"\",'Product benefit & adoption'!D42)","v":""},{"$f":"IF('Product benefit & adoption'!F42=\"\",\"\",'Product benefit & adoption'!F42)","v":""},0,{"$f":"_xlfn.IFS('Product benefit & adoption'!$G$4=\"ALL\",'Product benefit & adoption'!AA42*'Product benefit & adoption'!$P42/1000000,'Product benefit & adoption'!$G$4=\"2020-25\",'Product benefit & adoption'!AA42*'Product benefit & adoption'!$N42/1000000,'Product benefit & adoption'!$G$4=\"2015-20\",'Product benefit & adoption'!AA42*'Product benefit & adoption'!$L42/1000000)","v":0},{"$f":"_xlfn.IFS('Product benefit & adoption'!$G$4=\"ALL\",'Product benefit & adoption'!AB42*'Product benefit & adoption'!$P42/1000000,'Product benefit & adoption'!$G$4=\"2020-25\",'Product benefit & adoption'!AB42*'Product benefit & adoption'!$N42/1000000,'Product benefit & adoption'!$G$4=\"2015-20\",'Product benefit & adoption'!AB42*'Product benefit & adoption'!$L42/1000000)","v":0},{"$f":"_xlfn.IFS('Product benefit & adoption'!$G$4=\"ALL\",'Product benefit & adoption'!AC42*'Product benefit & adoption'!$P42/1000000,'Product benefit & adoption'!$G$4=\"2020-25\",'Product benefit & adoption'!AC42*'Product benefit & adoption'!$N42/1000000,'Product benefit & adoption'!$G$4=\"2015-20\",'Product benefit & adoption'!AC42*'Product benefit & adoption'!$L42/1000000)","v":0},{"$f":"_xlfn.IFS('Product benefit & adoption'!$G$4=\"ALL\",'Product benefit & adoption'!AD42*'Product benefit & adoption'!$P42/1000000,'Product benefit & adoption'!$G$4=\"2020-25\",'Product benefit & adoption'!AD42*'Product benefit & adoption'!$N42/1000000,'Product benefit & adoption'!$G$4=\"2015-20\",'Product benefit & adoption'!AD42*'Product benefit & adoption'!$L42/1000000)","v":0},{"$f":"_xlfn.IFS('Product benefit & adoption'!$G$4=\"ALL\",'Product benefit & adoption'!AE42*'Product benefit & adoption'!$P42/1000000,'Product benefit & adoption'!$G$4=\"2020-25\",'Product benefit & adoption'!AE42*'Product benefit & adoption'!$N42/1000000,'Product benefit & adoption'!$G$4=\"2015-20\",'Product benefit & adoption'!AE42*'Product benefit & adoption'!$L42/1000000)","v":0},{"$f":"_xlfn.IFS('Product benefit & adoption'!$G$4=\"ALL\",'Product benefit & adoption'!AF42*'Product benefit & adoption'!$P42/1000000,'Product benefit & adoption'!$G$4=\"2020-25\",'Product benefit & adoption'!AF42*'Product benefit & adoption'!$N42/1000000,'Product benefit & adoption'!$G$4=\"2015-20\",'Product benefit & adoption'!AF42*'Product benefit & adoption'!$L42/1000000)","v":0},{"$f":"_xlfn.IFS('Product benefit & adoption'!$G$4=\"ALL\",'Product benefit & adoption'!AG42*'Product benefit & adoption'!$P42/1000000,'Product benefit & adoption'!$G$4=\"2020-25\",'Product benefit & adoption'!AG42*'Product benefit & adoption'!$N42/1000000,'Product benefit & adoption'!$G$4=\"2015-20\",'Product benefit & adoption'!AG42*'Product benefit & adoption'!$L42/1000000)","v":0},{"$f":"_xlfn.IFS('Product benefit & adoption'!$G$4=\"ALL\",'Product benefit & adoption'!AH42*'Product benefit & adoption'!$P42/1000000,'Product benefit & adoption'!$G$4=\"2020-25\",'Product benefit & adoption'!AH42*'Product benefit & adoption'!$N42/1000000,'Product benefit & adoption'!$G$4=\"2015-20\",'Product benefit & adoption'!AH42*'Product benefit & adoption'!$L42/1000000)","v":0},{"$f":"_xlfn.IFS('Product benefit & adoption'!$G$4=\"ALL\",'Product benefit & adoption'!AI42*'Product benefit & adoption'!$P42/1000000,'Product benefit & adoption'!$G$4=\"2020-25\",'Product benefit & adoption'!AI42*'Product benefit & adoption'!$N42/1000000,'Product benefit & adoption'!$G$4=\"2015-20\",'Product benefit & adoption'!AI42*'Product benefit & adoption'!$L42/1000000)","v":0},{"$f":"_xlfn.IFS('Product benefit & adoption'!$G$4=\"ALL\",'Product benefit & adoption'!AJ42*'Product benefit & adoption'!$P42/1000000,'Product benefit & adoption'!$G$4=\"2020-25\",'Product benefit & adoption'!AJ42*'Product benefit & adoption'!$N42/1000000,'Product benefit & adoption'!$G$4=\"2015-20\",'Product benefit & adoption'!AJ42*'Product benefit & adoption'!$L42/1000000)","v":0},{"$f":"_xlfn.IFS('Product benefit & adoption'!$G$4=\"ALL\",'Product benefit & adoption'!AK42*'Product benefit & adoption'!$P42/1000000,'Product benefit & adoption'!$G$4=\"2020-25\",'Product benefit & adoption'!AK42*'Product benefit & adoption'!$N42/1000000,'Product benefit & adoption'!$G$4=\"2015-20\",'Product benefit & adoption'!AK42*'Product benefit & adoption'!$L42/1000000)","v":0},{"$f":"_xlfn.IFS('Product benefit & adoption'!$G$4=\"ALL\",'Product benefit & adoption'!AL42*'Product benefit & adoption'!$P42/1000000,'Product benefit & adoption'!$G$4=\"2020-25\",'Product benefit & adoption'!AL42*'Product benefit & adoption'!$N42/1000000,'Product benefit & adoption'!$G$4=\"2015-20\",'Product benefit & adoption'!AL42*'Product benefit & adoption'!$L42/1000000)","v":0},{"$f":"_xlfn.IFS('Product benefit & adoption'!$G$4=\"ALL\",'Product benefit & adoption'!AM42*'Product benefit & adoption'!$P42/1000000,'Product benefit & adoption'!$G$4=\"2020-25\",'Product benefit & adoption'!AM42*'Product benefit & adoption'!$N42/1000000,'Product benefit & adoption'!$G$4=\"2015-20\",'Product benefit & adoption'!AM42*'Product benefit & adoption'!$L42/1000000)","v":0},{"$f":"_xlfn.IFS('Product benefit & adoption'!$G$4=\"ALL\",'Product benefit & adoption'!AN42*'Product benefit & adoption'!$P42/1000000,'Product benefit & adoption'!$G$4=\"2020-25\",'Product benefit & adoption'!AN42*'Product benefit & adoption'!$N42/1000000,'Product benefit & adoption'!$G$4=\"2015-20\",'Product benefit & adoption'!AN42*'Product benefit & adoption'!$L42/1000000)","v":0},{"$f":"_xlfn.IFS('Product benefit & adoption'!$G$4=\"ALL\",'Product benefit & adoption'!AO42*'Product benefit & adoption'!$P42/1000000,'Product benefit & adoption'!$G$4=\"2020-25\",'Product benefit & adoption'!AO42*'Product benefit & adoption'!$N42/1000000,'Product benefit & adoption'!$G$4=\"2015-20\",'Product benefit & adoption'!AO42*'Product benefit & adoption'!$L42/1000000)","v":0},{"$f":"_xlfn.IFS('Product benefit & adoption'!$G$4=\"ALL\",'Product benefit & adoption'!AP42*'Product benefit & adoption'!$P42/1000000,'Product benefit & adoption'!$G$4=\"2020-25\",'Product benefit & adoption'!AP42*'Product benefit & adoption'!$N42/1000000,'Product benefit & adoption'!$G$4=\"2015-20\",'Product benefit & adoption'!AP42*'Product benefit & adoption'!$L42/1000000)","v":0},{"$f":"_xlfn.IFS('Product benefit & adoption'!$G$4=\"ALL\",'Product benefit & adoption'!AQ42*'Product benefit & adoption'!$P42/1000000,'Product benefit & adoption'!$G$4=\"2020-25\",'Product benefit & adoption'!AQ42*'Product benefit & adoption'!$N42/1000000,'Product benefit & adoption'!$G$4=\"2015-20\",'Product benefit & adoption'!AQ42*'Product benefit & adoption'!$L42/1000000)","v":0},{"$f":"_xlfn.IFS('Product benefit & adoption'!$G$4=\"ALL\",'Product benefit & adoption'!AR42*'Product benefit & adoption'!$P42/1000000,'Product benefit & adoption'!$G$4=\"2020-25\",'Product benefit & adoption'!AR42*'Product benefit & adoption'!$N42/1000000,'Product benefit & adoption'!$G$4=\"2015-20\",'Product benefit & adoption'!AR42*'Product benefit & adoption'!$L42/1000000)","v":0},{"$f":"_xlfn.IFS('Product benefit & adoption'!$G$4=\"ALL\",'Product benefit & adoption'!AS42*'Product benefit & adoption'!$P42/1000000,'Product benefit & adoption'!$G$4=\"2020-25\",'Product benefit & adoption'!AS42*'Product benefit & adoption'!$N42/1000000,'Product benefit & adoption'!$G$4=\"2015-20\",'Product benefit & adoption'!AS42*'Product benefit & adoption'!$L42/1000000)","v":0},{"$f":"_xlfn.IFS('Product benefit & adoption'!$G$4=\"ALL\",'Product benefit & adoption'!AT42*'Product benefit & adoption'!$P42/1000000,'Product benefit & adoption'!$G$4=\"2020-25\",'Product benefit & adoption'!AT42*'Product benefit & adoption'!$N42/1000000,'Product benefit & adoption'!$G$4=\"2015-20\",'Product benefit & adoption'!AT42*'Product benefit & adoption'!$L42/1000000)","v":0},{"$f":"_xlfn.IFS('Product benefit & adoption'!$G$4=\"ALL\",'Product benefit & adoption'!AU42*'Product benefit & adoption'!$P42/1000000,'Product benefit & adoption'!$G$4=\"2020-25\",'Product benefit & adoption'!AU42*'Product benefit & adoption'!$N42/1000000,'Product benefit & adoption'!$G$4=\"2015-20\",'Product benefit & adoption'!AU42*'Product benefit & adoption'!$L42/1000000)","v":0},{"$f":"_xlfn.IFS('Product benefit & adoption'!$G$4=\"ALL\",'Product benefit & adoption'!AV42*'Product benefit & adoption'!$P42/1000000,'Product benefit & adoption'!$G$4=\"2020-25\",'Product benefit & adoption'!AV42*'Product benefit & adoption'!$N42/1000000,'Product benefit & adoption'!$G$4=\"2015-20\",'Product benefit & adoption'!AV42*'Product benefit & adoption'!$L42/1000000)","v":0},{"$f":"_xlfn.IFS('Product benefit & adoption'!$G$4=\"ALL\",'Product benefit & adoption'!AW42*'Product benefit & adoption'!$P42/1000000,'Product benefit & adoption'!$G$4=\"2020-25\",'Product benefit & adoption'!AW42*'Product benefit & adoption'!$N42/1000000,'Product benefit & adoption'!$G$4=\"2015-20\",'Product benefit & adoption'!AW42*'Product benefit & adoption'!$L42/1000000)","v":0},{"$f":"_xlfn.IFS('Product benefit & adoption'!$G$4=\"ALL\",'Product benefit & adoption'!AX42*'Product benefit & adoption'!$P42/1000000,'Product benefit & adoption'!$G$4=\"2020-25\",'Product benefit & adoption'!AX42*'Product benefit & adoption'!$N42/1000000,'Product benefit & adoption'!$G$4=\"2015-20\",'Product benefit & adoption'!AX42*'Product benefit & adoption'!$L42/1000000)","v":0},{"$f":"_xlfn.IFS('Product benefit & adoption'!$G$4=\"ALL\",'Product benefit & adoption'!AY42*'Product benefit & adoption'!$P42/1000000,'Product benefit & adoption'!$G$4=\"2020-25\",'Product benefit & adoption'!AY42*'Product benefit & adoption'!$N42/1000000,'Product benefit & adoption'!$G$4=\"2015-20\",'Product benefit & adoption'!AY42*'Product benefit & adoption'!$L42/1000000)","v":0},{"$f":"_xlfn.IFS('Product benefit & adoption'!$G$4=\"ALL\",'Product benefit & adoption'!AZ42*'Product benefit & adoption'!$P42/1000000,'Product benefit & adoption'!$G$4=\"2020-25\",'Product benefit & adoption'!AZ42*'Product benefit & adoption'!$N42/1000000,'Product benefit & adoption'!$G$4=\"2015-20\",'Product benefit & adoption'!AZ42*'Product benefit & adoption'!$L42/1000000)","v":0},{"$f":"_xlfn.IFS('Product benefit & adoption'!$G$4=\"ALL\",'Product benefit & adoption'!BA42*'Product benefit & adoption'!$P42/1000000,'Product benefit & adoption'!$G$4=\"2020-25\",'Product benefit & adoption'!BA42*'Product benefit & adoption'!$N42/1000000,'Product benefit & adoption'!$G$4=\"2015-20\",'Product benefit & adoption'!BA42*'Product benefit & adoption'!$L42/1000000)","v":0},{"$f":"_xlfn.IFS('Product benefit & adoption'!$G$4=\"ALL\",'Product benefit & adoption'!BB42*'Product benefit & adoption'!$P42/1000000,'Product benefit & adoption'!$G$4=\"2020-25\",'Product benefit & adoption'!BB42*'Product benefit & adoption'!$N42/1000000,'Product benefit & adoption'!$G$4=\"2015-20\",'Product benefit & adoption'!BB42*'Product benefit & adoption'!$L42/1000000)","v":0},{"$f":"_xlfn.IFS('Product benefit & adoption'!$G$4=\"ALL\",'Product benefit & adoption'!BC42*'Product benefit & adoption'!$P42/1000000,'Product benefit & adoption'!$G$4=\"2020-25\",'Product benefit & adoption'!BC42*'Product benefit & adoption'!$N42/1000000,'Product benefit & adoption'!$G$4=\"2015-20\",'Product benefit & adoption'!BC42*'Product benefit & adoption'!$L42/1000000)","v":0},{"$f":"_xlfn.IFS('Product benefit & adoption'!$G$4=\"ALL\",'Product benefit & adoption'!BD42*'Product benefit & adoption'!$P42/1000000,'Product benefit & adoption'!$G$4=\"2020-25\",'Product benefit & adoption'!BD42*'Product benefit & adoption'!$N42/1000000,'Product benefit & adoption'!$G$4=\"2015-20\",'Product benefit & adoption'!BD42*'Product benefit & adoption'!$L42/1000000)","v":0}]
[null,33,{"$f":"IF('Product benefit & adoption'!D43=\"\",\"\",'Product benefit & adoption'!D43)","v":""},{"$f":"IF('Product benefit & adoption'!F43=\"\",\"\",'Product benefit & adoption'!F43)","v":""},0,{"$f":"_xlfn.IFS('Product benefit & adoption'!$G$4=\"ALL\",'Product benefit & adoption'!AA43*'Product benefit & adoption'!$P43/1000000,'Product benefit & adoption'!$G$4=\"2020-25\",'Product benefit & adoption'!AA43*'Product benefit & adoption'!$N43/1000000,'Product benefit & adoption'!$G$4=\"2015-20\",'Product benefit & adoption'!AA43*'Product benefit & adoption'!$L43/1000000)","v":0},{"$f":"_xlfn.IFS('Product benefit & adoption'!$G$4=\"ALL\",'Product benefit & adoption'!AB43*'Product benefit & adoption'!$P43/1000000,'Product benefit & adoption'!$G$4=\"2020-25\",'Product benefit & adoption'!AB43*'Product benefit & adoption'!$N43/1000000,'Product benefit & adoption'!$G$4=\"2015-20\",'Product benefit & adoption'!AB43*'Product benefit & adoption'!$L43/1000000)","v":0},{"$f":"_xlfn.IFS('Product benefit & adoption'!$G$4=\"ALL\",'Product benefit & adoption'!AC43*'Product benefit & adoption'!$P43/1000000,'Product benefit & adoption'!$G$4=\"2020-25\",'Product benefit & adoption'!AC43*'Product benefit & adoption'!$N43/1000000,'Product benefit & adoption'!$G$4=\"2015-20\",'Product benefit & adoption'!AC43*'Product benefit & adoption'!$L43/1000000)","v":0},{"$f":"_xlfn.IFS('Product benefit & adoption'!$G$4=\"ALL\",'Product benefit & adoption'!AD43*'Product benefit & adoption'!$P43/1000000,'Product benefit & adoption'!$G$4=\"2020-25\",'Product benefit & adoption'!AD43*'Product benefit & adoption'!$N43/1000000,'Product benefit & adoption'!$G$4=\"2015-20\",'Product benefit & adoption'!AD43*'Product benefit & adoption'!$L43/1000000)","v":0},{"$f":"_xlfn.IFS('Product benefit & adoption'!$G$4=\"ALL\",'Product benefit & adoption'!AE43*'Product benefit & adoption'!$P43/1000000,'Product benefit & adoption'!$G$4=\"2020-25\",'Product benefit & adoption'!AE43*'Product benefit & adoption'!$N43/1000000,'Product benefit & adoption'!$G$4=\"2015-20\",'Product benefit & adoption'!AE43*'Product benefit & adoption'!$L43/1000000)","v":0},{"$f":"_xlfn.IFS('Product benefit & adoption'!$G$4=\"ALL\",'Product benefit & adoption'!AF43*'Product benefit & adoption'!$P43/1000000,'Product benefit & adoption'!$G$4=\"2020-25\",'Product benefit & adoption'!AF43*'Product benefit & adoption'!$N43/1000000,'Product benefit & adoption'!$G$4=\"2015-20\",'Product benefit & adoption'!AF43*'Product benefit & adoption'!$L43/1000000)","v":0},{"$f":"_xlfn.IFS('Product benefit & adoption'!$G$4=\"ALL\",'Product benefit & adoption'!AG43*'Product benefit & adoption'!$P43/1000000,'Product benefit & adoption'!$G$4=\"2020-25\",'Product benefit & adoption'!AG43*'Product benefit & adoption'!$N43/1000000,'Product benefit & adoption'!$G$4=\"2015-20\",'Product benefit & adoption'!AG43*'Product benefit & adoption'!$L43/1000000)","v":0},{"$f":"_xlfn.IFS('Product benefit & adoption'!$G$4=\"ALL\",'Product benefit & adoption'!AH43*'Product benefit & adoption'!$P43/1000000,'Product benefit & adoption'!$G$4=\"2020-25\",'Product benefit & adoption'!AH43*'Product benefit & adoption'!$N43/1000000,'Product benefit & adoption'!$G$4=\"2015-20\",'Product benefit & adoption'!AH43*'Product benefit & adoption'!$L43/1000000)","v":0},{"$f":"_xlfn.IFS('Product benefit & adoption'!$G$4=\"ALL\",'Product benefit & adoption'!AI43*'Product benefit & adoption'!$P43/1000000,'Product benefit & adoption'!$G$4=\"2020-25\",'Product benefit & adoption'!AI43*'Product benefit & adoption'!$N43/1000000,'Product benefit & adoption'!$G$4=\"2015-20\",'Product benefit & adoption'!AI43*'Product benefit & adoption'!$L43/1000000)","v":0},{"$f":"_xlfn.IFS('Product benefit & adoption'!$G$4=\"ALL\",'Product benefit & adoption'!AJ43*'Product benefit & adoption'!$P43/1000000,'Product benefit & adoption'!$G$4=\"2020-25\",'Product benefit & adoption'!AJ43*'Product benefit & adoption'!$N43/1000000,'Product benefit & adoption'!$G$4=\"2015-20\",'Product benefit & adoption'!AJ43*'Product benefit & adoption'!$L43/1000000)","v":0},{"$f":"_xlfn.IFS('Product benefit & adoption'!$G$4=\"ALL\",'Product benefit & adoption'!AK43*'Product benefit & adoption'!$P43/1000000,'Product benefit & adoption'!$G$4=\"2020-25\",'Product benefit & adoption'!AK43*'Product benefit & adoption'!$N43/1000000,'Product benefit & adoption'!$G$4=\"2015-20\",'Product benefit & adoption'!AK43*'Product benefit & adoption'!$L43/1000000)","v":0},{"$f":"_xlfn.IFS('Product benefit & adoption'!$G$4=\"ALL\",'Product benefit & adoption'!AL43*'Product benefit & adoption'!$P43/1000000,'Product benefit & adoption'!$G$4=\"2020-25\",'Product benefit & adoption'!AL43*'Product benefit & adoption'!$N43/1000000,'Product benefit & adoption'!$G$4=\"2015-20\",'Product benefit & adoption'!AL43*'Product benefit & adoption'!$L43/1000000)","v":0},{"$f":"_xlfn.IFS('Product benefit & adoption'!$G$4=\"ALL\",'Product benefit & adoption'!AM43*'Product benefit & adoption'!$P43/1000000,'Product benefit & adoption'!$G$4=\"2020-25\",'Product benefit & adoption'!AM43*'Product benefit & adoption'!$N43/1000000,'Product benefit & adoption'!$G$4=\"2015-20\",'Product benefit & adoption'!AM43*'Product benefit & adoption'!$L43/1000000)","v":0},{"$f":"_xlfn.IFS('Product benefit & adoption'!$G$4=\"ALL\",'Product benefit & adoption'!AN43*'Product benefit & adoption'!$P43/1000000,'Product benefit & adoption'!$G$4=\"2020-25\",'Product benefit & adoption'!AN43*'Product benefit & adoption'!$N43/1000000,'Product benefit & adoption'!$G$4=\"2015-20\",'Product benefit & adoption'!AN43*'Product benefit & adoption'!$L43/1000000)","v":0},{"$f":"_xlfn.IFS('Product benefit & adoption'!$G$4=\"ALL\",'Product benefit & adoption'!AO43*'Product benefit & adoption'!$P43/1000000,'Product benefit & adoption'!$G$4=\"2020-25\",'Product benefit & adoption'!AO43*'Product benefit & adoption'!$N43/1000000,'Product benefit & adoption'!$G$4=\"2015-20\",'Product benefit & adoption'!AO43*'Product benefit & adoption'!$L43/1000000)","v":0},{"$f":"_xlfn.IFS('Product benefit & adoption'!$G$4=\"ALL\",'Product benefit & adoption'!AP43*'Product benefit & adoption'!$P43/1000000,'Product benefit & adoption'!$G$4=\"2020-25\",'Product benefit & adoption'!AP43*'Product benefit & adoption'!$N43/1000000,'Product benefit & adoption'!$G$4=\"2015-20\",'Product benefit & adoption'!AP43*'Product benefit & adoption'!$L43/1000000)","v":0},{"$f":"_xlfn.IFS('Product benefit & adoption'!$G$4=\"ALL\",'Product benefit & adoption'!AQ43*'Product benefit & adoption'!$P43/1000000,'Product benefit & adoption'!$G$4=\"2020-25\",'Product benefit & adoption'!AQ43*'Product benefit & adoption'!$N43/1000000,'Product benefit & adoption'!$G$4=\"2015-20\",'Product benefit & adoption'!AQ43*'Product benefit & adoption'!$L43/1000000)","v":0},{"$f":"_xlfn.IFS('Product benefit & adoption'!$G$4=\"ALL\",'Product benefit & adoption'!AR43*'Product benefit & adoption'!$P43/1000000,'Product benefit & adoption'!$G$4=\"2020-25\",'Product benefit & adoption'!AR43*'Product benefit & adoption'!$N43/1000000,'Product benefit & adoption'!$G$4=\"2015-20\",'Product benefit & adoption'!AR43*'Product benefit & adoption'!$L43/1000000)","v":0},{"$f":"_xlfn.IFS('Product benefit & adoption'!$G$4=\"ALL\",'Product benefit & adoption'!AS43*'Product benefit & adoption'!$P43/1000000,'Product benefit & adoption'!$G$4=\"2020-25\",'Product benefit & adoption'!AS43*'Product benefit & adoption'!$N43/1000000,'Product benefit & adoption'!$G$4=\"2015-20\",'Product benefit & adoption'!AS43*'Product benefit & adoption'!$L43/1000000)","v":0},{"$f":"_xlfn.IFS('Product benefit & adoption'!$G$4=\"ALL\",'Product benefit & adoption'!AT43*'Product benefit & adoption'!$P43/1000000,'Product benefit & adoption'!$G$4=\"2020-25\",'Product benefit & adoption'!AT43*'Product benefit & adoption'!$N43/1000000,'Product benefit & adoption'!$G$4=\"2015-20\",'Product benefit & adoption'!AT43*'Product benefit & adoption'!$L43/1000000)","v":0},{"$f":"_xlfn.IFS('Product benefit & adoption'!$G$4=\"ALL\",'Product benefit & adoption'!AU43*'Product benefit & adoption'!$P43/1000000,'Product benefit & adoption'!$G$4=\"2020-25\",'Product benefit & adoption'!AU43*'Product benefit & adoption'!$N43/1000000,'Product benefit & adoption'!$G$4=\"2015-20\",'Product benefit & adoption'!AU43*'Product benefit & adoption'!$L43/1000000)","v":0},{"$f":"_xlfn.IFS('Product benefit & adoption'!$G$4=\"ALL\",'Product benefit & adoption'!AV43*'Product benefit & adoption'!$P43/1000000,'Product benefit & adoption'!$G$4=\"2020-25\",'Product benefit & adoption'!AV43*'Product benefit & adoption'!$N43/1000000,'Product benefit & adoption'!$G$4=\"2015-20\",'Product benefit & adoption'!AV43*'Product benefit & adoption'!$L43/1000000)","v":0},{"$f":"_xlfn.IFS('Product benefit & adoption'!$G$4=\"ALL\",'Product benefit & adoption'!AW43*'Product benefit & adoption'!$P43/1000000,'Product benefit & adoption'!$G$4=\"2020-25\",'Product benefit & adoption'!AW43*'Product benefit & adoption'!$N43/1000000,'Product benefit & adoption'!$G$4=\"2015-20\",'Product benefit & adoption'!AW43*'Product benefit & adoption'!$L43/1000000)","v":0},{"$f":"_xlfn.IFS('Product benefit & adoption'!$G$4=\"ALL\",'Product benefit & adoption'!AX43*'Product benefit & adoption'!$P43/1000000,'Product benefit & adoption'!$G$4=\"2020-25\",'Product benefit & adoption'!AX43*'Product benefit & adoption'!$N43/1000000,'Product benefit & adoption'!$G$4=\"2015-20\",'Product benefit & adoption'!AX43*'Product benefit & adoption'!$L43/1000000)","v":0},{"$f":"_xlfn.IFS('Product benefit & adoption'!$G$4=\"ALL\",'Product benefit & adoption'!AY43*'Product benefit & adoption'!$P43/1000000,'Product benefit & adoption'!$G$4=\"2020-25\",'Product benefit & adoption'!AY43*'Product benefit & adoption'!$N43/1000000,'Product benefit & adoption'!$G$4=\"2015-20\",'Product benefit & adoption'!AY43*'Product benefit & adoption'!$L43/1000000)","v":0},{"$f":"_xlfn.IFS('Product benefit & adoption'!$G$4=\"ALL\",'Product benefit & adoption'!AZ43*'Product benefit & adoption'!$P43/1000000,'Product benefit & adoption'!$G$4=\"2020-25\",'Product benefit & adoption'!AZ43*'Product benefit & adoption'!$N43/1000000,'Product benefit & adoption'!$G$4=\"2015-20\",'Product benefit & adoption'!AZ43*'Product benefit & adoption'!$L43/1000000)","v":0},{"$f":"_xlfn.IFS('Product benefit & adoption'!$G$4=\"ALL\",'Product benefit & adoption'!BA43*'Product benefit & adoption'!$P43/1000000,'Product benefit & adoption'!$G$4=\"2020-25\",'Product benefit & adoption'!BA43*'Product benefit & adoption'!$N43/1000000,'Product benefit & adoption'!$G$4=\"2015-20\",'Product benefit & adoption'!BA43*'Product benefit & adoption'!$L43/1000000)","v":0},{"$f":"_xlfn.IFS('Product benefit & adoption'!$G$4=\"ALL\",'Product benefit & adoption'!BB43*'Product benefit & adoption'!$P43/1000000,'Product benefit & adoption'!$G$4=\"2020-25\",'Product benefit & adoption'!BB43*'Product benefit & adoption'!$N43/1000000,'Product benefit & adoption'!$G$4=\"2015-20\",'Product benefit & adoption'!BB43*'Product benefit & adoption'!$L43/1000000)","v":0},{"$f":"_xlfn.IFS('Product benefit & adoption'!$G$4=\"ALL\",'Product benefit & adoption'!BC43*'Product benefit & adoption'!$P43/1000000,'Product benefit & adoption'!$G$4=\"2020-25\",'Product benefit & adoption'!BC43*'Product benefit & adoption'!$N43/1000000,'Product benefit & adoption'!$G$4=\"2015-20\",'Product benefit & adoption'!BC43*'Product benefit & adoption'!$L43/1000000)","v":0},{"$f":"_xlfn.IFS('Product benefit & adoption'!$G$4=\"ALL\",'Product benefit & adoption'!BD43*'Product benefit & adoption'!$P43/1000000,'Product benefit & adoption'!$G$4=\"2020-25\",'Product benefit & adoption'!BD43*'Product benefit & adoption'!$N43/1000000,'Product benefit & adoption'!$G$4=\"2015-20\",'Product benefit & adoption'!BD43*'Product benefit & adoption'!$L43/1000000)","v":0}]
[null,34,{"$f":"IF('Product benefit & adoption'!D44=\"\",\"\",'Product benefit & adoption'!D44)","v":""},{"$f":"IF('Product benefit & adoption'!F44=\"\",\"\",'Product benefit & adoption'!F44)","v":""},0,{"$f":"_xlfn.IFS('Product benefit & adoption'!$G$4=\"ALL\",'Product benefit & adoption'!AA44*'Product benefit & adoption'!$P44/1000000,'Product benefit & adoption'!$G$4=\"2020-25\",'Product benefit & adoption'!AA44*'Product benefit & adoption'!$N44/1000000,'Product benefit & adoption'!$G$4=\"2015-20\",'Product benefit & adoption'!AA44*'Product benefit & adoption'!$L44/1000000)","v":0},{"$f":"_xlfn.IFS('Product benefit & adoption'!$G$4=\"ALL\",'Product benefit & adoption'!AB44*'Product benefit & adoption'!$P44/1000000,'Product benefit & adoption'!$G$4=\"2020-25\",'Product benefit & adoption'!AB44*'Product benefit & adoption'!$N44/1000000,'Product benefit & adoption'!$G$4=\"2015-20\",'Product benefit & adoption'!AB44*'Product benefit & adoption'!$L44/1000000)","v":0},{"$f":"_xlfn.IFS('Product benefit & adoption'!$G$4=\"ALL\",'Product benefit & adoption'!AC44*'Product benefit & adoption'!$P44/1000000,'Product benefit & adoption'!$G$4=\"2020-25\",'Product benefit & adoption'!AC44*'Product benefit & adoption'!$N44/1000000,'Product benefit & adoption'!$G$4=\"2015-20\",'Product benefit & adoption'!AC44*'Product benefit & adoption'!$L44/1000000)","v":0},{"$f":"_xlfn.IFS('Product benefit & adoption'!$G$4=\"ALL\",'Product benefit & adoption'!AD44*'Product benefit & adoption'!$P44/1000000,'Product benefit & adoption'!$G$4=\"2020-25\",'Product benefit & adoption'!AD44*'Product benefit & adoption'!$N44/1000000,'Product benefit & adoption'!$G$4=\"2015-20\",'Product benefit & adoption'!AD44*'Product benefit & adoption'!$L44/1000000)","v":0},{"$f":"_xlfn.IFS('Product benefit & adoption'!$G$4=\"ALL\",'Product benefit & adoption'!AE44*'Product benefit & adoption'!$P44/1000000,'Product benefit & adoption'!$G$4=\"2020-25\",'Product benefit & adoption'!AE44*'Product benefit & adoption'!$N44/1000000,'Product benefit & adoption'!$G$4=\"2015-20\",'Product benefit & adoption'!AE44*'Product benefit & adoption'!$L44/1000000)","v":0},{"$f":"_xlfn.IFS('Product benefit & adoption'!$G$4=\"ALL\",'Product benefit & adoption'!AF44*'Product benefit & adoption'!$P44/1000000,'Product benefit & adoption'!$G$4=\"2020-25\",'Product benefit & adoption'!AF44*'Product benefit & adoption'!$N44/1000000,'Product benefit & adoption'!$G$4=\"2015-20\",'Product benefit & adoption'!AF44*'Product benefit & adoption'!$L44/1000000)","v":0},{"$f":"_xlfn.IFS('Product benefit & adoption'!$G$4=\"ALL\",'Product benefit & adoption'!AG44*'Product benefit & adoption'!$P44/1000000,'Product benefit & adoption'!$G$4=\"2020-25\",'Product benefit & adoption'!AG44*'Product benefit & adoption'!$N44/1000000,'Product benefit & adoption'!$G$4=\"2015-20\",'Product benefit & adoption'!AG44*'Product benefit & adoption'!$L44/1000000)","v":0},{"$f":"_xlfn.IFS('Product benefit & adoption'!$G$4=\"ALL\",'Product benefit & adoption'!AH44*'Product benefit & adoption'!$P44/1000000,'Product benefit & adoption'!$G$4=\"2020-25\",'Product benefit & adoption'!AH44*'Product benefit & adoption'!$N44/1000000,'Product benefit & adoption'!$G$4=\"2015-20\",'Product benefit & adoption'!AH44*'Product benefit & adoption'!$L44/1000000)","v":0},{"$f":"_xlfn.IFS('Product benefit & adoption'!$G$4=\"ALL\",'Product benefit & adoption'!AI44*'Product benefit & adoption'!$P44/1000000,'Product benefit & adoption'!$G$4=\"2020-25\",'Product benefit & adoption'!AI44*'Product benefit & adoption'!$N44/1000000,'Product benefit & adoption'!$G$4=\"2015-20\",'Product benefit & adoption'!AI44*'Product benefit & adoption'!$L44/1000000)","v":0},{"$f":"_xlfn.IFS('Product benefit & adoption'!$G$4=\"ALL\",'Product benefit & adoption'!AJ44*'Product benefit & adoption'!$P44/1000000,'Product benefit & adoption'!$G$4=\"2020-25\",'Product benefit & adoption'!AJ44*'Product benefit & adoption'!$N44/1000000,'Product benefit & adoption'!$G$4=\"2015-20\",'Product benefit & adoption'!AJ44*'Product benefit & adoption'!$L44/1000000)","v":0},{"$f":"_xlfn.IFS('Product benefit & adoption'!$G$4=\"ALL\",'Product benefit & adoption'!AK44*'Product benefit & adoption'!$P44/1000000,'Product benefit & adoption'!$G$4=\"2020-25\",'Product benefit & adoption'!AK44*'Product benefit & adoption'!$N44/1000000,'Product benefit & adoption'!$G$4=\"2015-20\",'Product benefit & adoption'!AK44*'Product benefit & adoption'!$L44/1000000)","v":0},{"$f":"_xlfn.IFS('Product benefit & adoption'!$G$4=\"ALL\",'Product benefit & adoption'!AL44*'Product benefit & adoption'!$P44/1000000,'Product benefit & adoption'!$G$4=\"2020-25\",'Product benefit & adoption'!AL44*'Product benefit & adoption'!$N44/1000000,'Product benefit & adoption'!$G$4=\"2015-20\",'Product benefit & adoption'!AL44*'Product benefit & adoption'!$L44/1000000)","v":0},{"$f":"_xlfn.IFS('Product benefit & adoption'!$G$4=\"ALL\",'Product benefit & adoption'!AM44*'Product benefit & adoption'!$P44/1000000,'Product benefit & adoption'!$G$4=\"2020-25\",'Product benefit & adoption'!AM44*'Product benefit & adoption'!$N44/1000000,'Product benefit & adoption'!$G$4=\"2015-20\",'Product benefit & adoption'!AM44*'Product benefit & adoption'!$L44/1000000)","v":0},{"$f":"_xlfn.IFS('Product benefit & adoption'!$G$4=\"ALL\",'Product benefit & adoption'!AN44*'Product benefit & adoption'!$P44/1000000,'Product benefit & adoption'!$G$4=\"2020-25\",'Product benefit & adoption'!AN44*'Product benefit & adoption'!$N44/1000000,'Product benefit & adoption'!$G$4=\"2015-20\",'Product benefit & adoption'!AN44*'Product benefit & adoption'!$L44/1000000)","v":0},{"$f":"_xlfn.IFS('Product benefit & adoption'!$G$4=\"ALL\",'Product benefit & adoption'!AO44*'Product benefit & adoption'!$P44/1000000,'Product benefit & adoption'!$G$4=\"2020-25\",'Product benefit & adoption'!AO44*'Product benefit & adoption'!$N44/1000000,'Product benefit & adoption'!$G$4=\"2015-20\",'Product benefit & adoption'!AO44*'Product benefit & adoption'!$L44/1000000)","v":0},{"$f":"_xlfn.IFS('Product benefit & adoption'!$G$4=\"ALL\",'Product benefit & adoption'!AP44*'Product benefit & adoption'!$P44/1000000,'Product benefit & adoption'!$G$4=\"2020-25\",'Product benefit & adoption'!AP44*'Product benefit & adoption'!$N44/1000000,'Product benefit & adoption'!$G$4=\"2015-20\",'Product benefit & adoption'!AP44*'Product benefit & adoption'!$L44/1000000)","v":0},{"$f":"_xlfn.IFS('Product benefit & adoption'!$G$4=\"ALL\",'Product benefit & adoption'!AQ44*'Product benefit & adoption'!$P44/1000000,'Product benefit & adoption'!$G$4=\"2020-25\",'Product benefit & adoption'!AQ44*'Product benefit & adoption'!$N44/1000000,'Product benefit & adoption'!$G$4=\"2015-20\",'Product benefit & adoption'!AQ44*'Product benefit & adoption'!$L44/1000000)","v":0},{"$f":"_xlfn.IFS('Product benefit & adoption'!$G$4=\"ALL\",'Product benefit & adoption'!AR44*'Product benefit & adoption'!$P44/1000000,'Product benefit & adoption'!$G$4=\"2020-25\",'Product benefit & adoption'!AR44*'Product benefit & adoption'!$N44/1000000,'Product benefit & adoption'!$G$4=\"2015-20\",'Product benefit & adoption'!AR44*'Product benefit & adoption'!$L44/1000000)","v":0},{"$f":"_xlfn.IFS('Product benefit & adoption'!$G$4=\"ALL\",'Product benefit & adoption'!AS44*'Product benefit & adoption'!$P44/1000000,'Product benefit & adoption'!$G$4=\"2020-25\",'Product benefit & adoption'!AS44*'Product benefit & adoption'!$N44/1000000,'Product benefit & adoption'!$G$4=\"2015-20\",'Product benefit & adoption'!AS44*'Product benefit & adoption'!$L44/1000000)","v":0},{"$f":"_xlfn.IFS('Product benefit & adoption'!$G$4=\"ALL\",'Product benefit & adoption'!AT44*'Product benefit & adoption'!$P44/1000000,'Product benefit & adoption'!$G$4=\"2020-25\",'Product benefit & adoption'!AT44*'Product benefit & adoption'!$N44/1000000,'Product benefit & adoption'!$G$4=\"2015-20\",'Product benefit & adoption'!AT44*'Product benefit & adoption'!$L44/1000000)","v":0},{"$f":"_xlfn.IFS('Product benefit & adoption'!$G$4=\"ALL\",'Product benefit & adoption'!AU44*'Product benefit & adoption'!$P44/1000000,'Product benefit & adoption'!$G$4=\"2020-25\",'Product benefit & adoption'!AU44*'Product benefit & adoption'!$N44/1000000,'Product benefit & adoption'!$G$4=\"2015-20\",'Product benefit & adoption'!AU44*'Product benefit & adoption'!$L44/1000000)","v":0},{"$f":"_xlfn.IFS('Product benefit & adoption'!$G$4=\"ALL\",'Product benefit & adoption'!AV44*'Product benefit & adoption'!$P44/1000000,'Product benefit & adoption'!$G$4=\"2020-25\",'Product benefit & adoption'!AV44*'Product benefit & adoption'!$N44/1000000,'Product benefit & adoption'!$G$4=\"2015-20\",'Product benefit & adoption'!AV44*'Product benefit & adoption'!$L44/1000000)","v":0},{"$f":"_xlfn.IFS('Product benefit & adoption'!$G$4=\"ALL\",'Product benefit & adoption'!AW44*'Product benefit & adoption'!$P44/1000000,'Product benefit & adoption'!$G$4=\"2020-25\",'Product benefit & adoption'!AW44*'Product benefit & adoption'!$N44/1000000,'Product benefit & adoption'!$G$4=\"2015-20\",'Product benefit & adoption'!AW44*'Product benefit & adoption'!$L44/1000000)","v":0},{"$f":"_xlfn.IFS('Product benefit & adoption'!$G$4=\"ALL\",'Product benefit & adoption'!AX44*'Product benefit & adoption'!$P44/1000000,'Product benefit & adoption'!$G$4=\"2020-25\",'Product benefit & adoption'!AX44*'Product benefit & adoption'!$N44/1000000,'Product benefit & adoption'!$G$4=\"2015-20\",'Product benefit & adoption'!AX44*'Product benefit & adoption'!$L44/1000000)","v":0},{"$f":"_xlfn.IFS('Product benefit & adoption'!$G$4=\"ALL\",'Product benefit & adoption'!AY44*'Product benefit & adoption'!$P44/1000000,'Product benefit & adoption'!$G$4=\"2020-25\",'Product benefit & adoption'!AY44*'Product benefit & adoption'!$N44/1000000,'Product benefit & adoption'!$G$4=\"2015-20\",'Product benefit & adoption'!AY44*'Product benefit & adoption'!$L44/1000000)","v":0},{"$f":"_xlfn.IFS('Product benefit & adoption'!$G$4=\"ALL\",'Product benefit & adoption'!AZ44*'Product benefit & adoption'!$P44/1000000,'Product benefit & adoption'!$G$4=\"2020-25\",'Product benefit & adoption'!AZ44*'Product benefit & adoption'!$N44/1000000,'Product benefit & adoption'!$G$4=\"2015-20\",'Product benefit & adoption'!AZ44*'Product benefit & adoption'!$L44/1000000)","v":0},{"$f":"_xlfn.IFS('Product benefit & adoption'!$G$4=\"ALL\",'Product benefit & adoption'!BA44*'Product benefit & adoption'!$P44/1000000,'Product benefit & adoption'!$G$4=\"2020-25\",'Product benefit & adoption'!BA44*'Product benefit & adoption'!$N44/1000000,'Product benefit & adoption'!$G$4=\"2015-20\",'Product benefit & adoption'!BA44*'Product benefit & adoption'!$L44/1000000)","v":0},{"$f":"_xlfn.IFS('Product benefit & adoption'!$G$4=\"ALL\",'Product benefit & adoption'!BB44*'Product benefit & adoption'!$P44/1000000,'Product benefit & adoption'!$G$4=\"2020-25\",'Product benefit & adoption'!BB44*'Product benefit & adoption'!$N44/1000000,'Product benefit & adoption'!$G$4=\"2015-20\",'Product benefit & adoption'!BB44*'Product benefit & adoption'!$L44/1000000)","v":0},{"$f":"_xlfn.IFS('Product benefit & adoption'!$G$4=\"ALL\",'Product benefit & adoption'!BC44*'Product benefit & adoption'!$P44/1000000,'Product benefit & adoption'!$G$4=\"2020-25\",'Product benefit & adoption'!BC44*'Product benefit & adoption'!$N44/1000000,'Product benefit & adoption'!$G$4=\"2015-20\",'Product benefit & adoption'!BC44*'Product benefit & adoption'!$L44/1000000)","v":0},{"$f":"_xlfn.IFS('Product benefit & adoption'!$G$4=\"ALL\",'Product benefit & adoption'!BD44*'Product benefit & adoption'!$P44/1000000,'Product benefit & adoption'!$G$4=\"2020-25\",'Product benefit & adoption'!BD44*'Product benefit & adoption'!$N44/1000000,'Product benefit & adoption'!$G$4=\"2015-20\",'Product benefit & adoption'!BD44*'Product benefit & adoption'!$L44/1000000)","v":0}]
[null,35,{"$f":"IF('Product benefit & adoption'!D45=\"\",\"\",'Product benefit & adoption'!D45)","v":""},{"$f":"IF('Product benefit & adoption'!F45=\"\",\"\",'Product benefit & adoption'!F45)","v":""},0,{"$f":"_xlfn.IFS('Product benefit & adoption'!$G$4=\"ALL\",'Product benefit & adoption'!AA45*'Product benefit & adoption'!$P45/1000000,'Product benefit & adoption'!$G$4=\"2020-25\",'Product benefit & adoption'!AA45*'Product benefit & adoption'!$N45/1000000,'Product benefit & adoption'!$G$4=\"2015-20\",'Product benefit & adoption'!AA45*'Product benefit & adoption'!$L45/1000000)","v":0},{"$f":"_xlfn.IFS('Product benefit & adoption'!$G$4=\"ALL\",'Product benefit & adoption'!AB45*'Product benefit & adoption'!$P45/1000000,'Product benefit & adoption'!$G$4=\"2020-25\",'Product benefit & adoption'!AB45*'Product benefit & adoption'!$N45/1000000,'Product benefit & adoption'!$G$4=\"2015-20\",'Product benefit & adoption'!AB45*'Product benefit & adoption'!$L45/1000000)","v":0},{"$f":"_xlfn.IFS('Product benefit & adoption'!$G$4=\"ALL\",'Product benefit & adoption'!AC45*'Product benefit & adoption'!$P45/1000000,'Product benefit & adoption'!$G$4=\"2020-25\",'Product benefit & adoption'!AC45*'Product benefit & adoption'!$N45/1000000,'Product benefit & adoption'!$G$4=\"2015-20\",'Product benefit & adoption'!AC45*'Product benefit & adoption'!$L45/1000000)","v":0},{"$f":"_xlfn.IFS('Product benefit & adoption'!$G$4=\"ALL\",'Product benefit & adoption'!AD45*'Product benefit & adoption'!$P45/1000000,'Product benefit & adoption'!$G$4=\"2020-25\",'Product benefit & adoption'!AD45*'Product benefit & adoption'!$N45/1000000,'Product benefit & adoption'!$G$4=\"2015-20\",'Product benefit & adoption'!AD45*'Product benefit & adoption'!$L45/1000000)","v":0},{"$f":"_xlfn.IFS('Product benefit & adoption'!$G$4=\"ALL\",'Product benefit & adoption'!AE45*'Product benefit & adoption'!$P45/1000000,'Product benefit & adoption'!$G$4=\"2020-25\",'Product benefit & adoption'!AE45*'Product benefit & adoption'!$N45/1000000,'Product benefit & adoption'!$G$4=\"2015-20\",'Product benefit & adoption'!AE45*'Product benefit & adoption'!$L45/1000000)","v":0},{"$f":"_xlfn.IFS('Product benefit & adoption'!$G$4=\"ALL\",'Product benefit & adoption'!AF45*'Product benefit & adoption'!$P45/1000000,'Product benefit & adoption'!$G$4=\"2020-25\",'Product benefit & adoption'!AF45*'Product benefit & adoption'!$N45/1000000,'Product benefit & adoption'!$G$4=\"2015-20\",'Product benefit & adoption'!AF45*'Product benefit & adoption'!$L45/1000000)","v":0},{"$f":"_xlfn.IFS('Product benefit & adoption'!$G$4=\"ALL\",'Product benefit & adoption'!AG45*'Product benefit & adoption'!$P45/1000000,'Product benefit & adoption'!$G$4=\"2020-25\",'Product benefit & adoption'!AG45*'Product benefit & adoption'!$N45/1000000,'Product benefit & adoption'!$G$4=\"2015-20\",'Product benefit & adoption'!AG45*'Product benefit & adoption'!$L45/1000000)","v":0},{"$f":"_xlfn.IFS('Product benefit & adoption'!$G$4=\"ALL\",'Product benefit & adoption'!AH45*'Product benefit & adoption'!$P45/1000000,'Product benefit & adoption'!$G$4=\"2020-25\",'Product benefit & adoption'!AH45*'Product benefit & adoption'!$N45/1000000,'Product benefit & adoption'!$G$4=\"2015-20\",'Product benefit & adoption'!AH45*'Product benefit & adoption'!$L45/1000000)","v":0},{"$f":"_xlfn.IFS('Product benefit & adoption'!$G$4=\"ALL\",'Product benefit & adoption'!AI45*'Product benefit & adoption'!$P45/1000000,'Product benefit & adoption'!$G$4=\"2020-25\",'Product benefit & adoption'!AI45*'Product benefit & adoption'!$N45/1000000,'Product benefit & adoption'!$G$4=\"2015-20\",'Product benefit & adoption'!AI45*'Product benefit & adoption'!$L45/1000000)","v":0},{"$f":"_xlfn.IFS('Product benefit & adoption'!$G$4=\"ALL\",'Product benefit & adoption'!AJ45*'Product benefit & adoption'!$P45/1000000,'Product benefit & adoption'!$G$4=\"2020-25\",'Product benefit & adoption'!AJ45*'Product benefit & adoption'!$N45/1000000,'Product benefit & adoption'!$G$4=\"2015-20\",'Product benefit & adoption'!AJ45*'Product benefit & adoption'!$L45/1000000)","v":0},{"$f":"_xlfn.IFS('Product benefit & adoption'!$G$4=\"ALL\",'Product benefit & adoption'!AK45*'Product benefit & adoption'!$P45/1000000,'Product benefit & adoption'!$G$4=\"2020-25\",'Product benefit & adoption'!AK45*'Product benefit & adoption'!$N45/1000000,'Product benefit & adoption'!$G$4=\"2015-20\",'Product benefit & adoption'!AK45*'Product benefit & adoption'!$L45/1000000)","v":0},{"$f":"_xlfn.IFS('Product benefit & adoption'!$G$4=\"ALL\",'Product benefit & adoption'!AL45*'Product benefit & adoption'!$P45/1000000,'Product benefit & adoption'!$G$4=\"2020-25\",'Product benefit & adoption'!AL45*'Product benefit & adoption'!$N45/1000000,'Product benefit & adoption'!$G$4=\"2015-20\",'Product benefit & adoption'!AL45*'Product benefit & adoption'!$L45/1000000)","v":0},{"$f":"_xlfn.IFS('Product benefit & adoption'!$G$4=\"ALL\",'Product benefit & adoption'!AM45*'Product benefit & adoption'!$P45/1000000,'Product benefit & adoption'!$G$4=\"2020-25\",'Product benefit & adoption'!AM45*'Product benefit & adoption'!$N45/1000000,'Product benefit & adoption'!$G$4=\"2015-20\",'Product benefit & adoption'!AM45*'Product benefit & adoption'!$L45/1000000)","v":0},{"$f":"_xlfn.IFS('Product benefit & adoption'!$G$4=\"ALL\",'Product benefit & adoption'!AN45*'Product benefit & adoption'!$P45/1000000,'Product benefit & adoption'!$G$4=\"2020-25\",'Product benefit & adoption'!AN45*'Product benefit & adoption'!$N45/1000000,'Product benefit & adoption'!$G$4=\"2015-20\",'Product benefit & adoption'!AN45*'Product benefit & adoption'!$L45/1000000)","v":0},{"$f":"_xlfn.IFS('Product benefit & adoption'!$G$4=\"ALL\",'Product benefit & adoption'!AO45*'Product benefit & adoption'!$P45/1000000,'Product benefit & adoption'!$G$4=\"2020-25\",'Product benefit & adoption'!AO45*'Product benefit & adoption'!$N45/1000000,'Product benefit & adoption'!$G$4=\"2015-20\",'Product benefit & adoption'!AO45*'Product benefit & adoption'!$L45/1000000)","v":0},{"$f":"_xlfn.IFS('Product benefit & adoption'!$G$4=\"ALL\",'Product benefit & adoption'!AP45*'Product benefit & adoption'!$P45/1000000,'Product benefit & adoption'!$G$4=\"2020-25\",'Product benefit & adoption'!AP45*'Product benefit & adoption'!$N45/1000000,'Product benefit & adoption'!$G$4=\"2015-20\",'Product benefit & adoption'!AP45*'Product benefit & adoption'!$L45/1000000)","v":0},{"$f":"_xlfn.IFS('Product benefit & adoption'!$G$4=\"ALL\",'Product benefit & adoption'!AQ45*'Product benefit & adoption'!$P45/1000000,'Product benefit & adoption'!$G$4=\"2020-25\",'Product benefit & adoption'!AQ45*'Product benefit & adoption'!$N45/1000000,'Product benefit & adoption'!$G$4=\"2015-20\",'Product benefit & adoption'!AQ45*'Product benefit & adoption'!$L45/1000000)","v":0},{"$f":"_xlfn.IFS('Product benefit & adoption'!$G$4=\"ALL\",'Product benefit & adoption'!AR45*'Product benefit & adoption'!$P45/1000000,'Product benefit & adoption'!$G$4=\"2020-25\",'Product benefit & adoption'!AR45*'Product benefit & adoption'!$N45/1000000,'Product benefit & adoption'!$G$4=\"2015-20\",'Product benefit & adoption'!AR45*'Product benefit & adoption'!$L45/1000000)","v":0},{"$f":"_xlfn.IFS('Product benefit & adoption'!$G$4=\"ALL\",'Product benefit & adoption'!AS45*'Product benefit & adoption'!$P45/1000000,'Product benefit & adoption'!$G$4=\"2020-25\",'Product benefit & adoption'!AS45*'Product benefit & adoption'!$N45/1000000,'Product benefit & adoption'!$G$4=\"2015-20\",'Product benefit & adoption'!AS45*'Product benefit & adoption'!$L45/1000000)","v":0},{"$f":"_xlfn.IFS('Product benefit & adoption'!$G$4=\"ALL\",'Product benefit & adoption'!AT45*'Product benefit & adoption'!$P45/1000000,'Product benefit & adoption'!$G$4=\"2020-25\",'Product benefit & adoption'!AT45*'Product benefit & adoption'!$N45/1000000,'Product benefit & adoption'!$G$4=\"2015-20\",'Product benefit & adoption'!AT45*'Product benefit & adoption'!$L45/1000000)","v":0},{"$f":"_xlfn.IFS('Product benefit & adoption'!$G$4=\"ALL\",'Product benefit & adoption'!AU45*'Product benefit & adoption'!$P45/1000000,'Product benefit & adoption'!$G$4=\"2020-25\",'Product benefit & adoption'!AU45*'Product benefit & adoption'!$N45/1000000,'Product benefit & adoption'!$G$4=\"2015-20\",'Product benefit & adoption'!AU45*'Product benefit & adoption'!$L45/1000000)","v":0},{"$f":"_xlfn.IFS('Product benefit & adoption'!$G$4=\"ALL\",'Product benefit & adoption'!AV45*'Product benefit & adoption'!$P45/1000000,'Product benefit & adoption'!$G$4=\"2020-25\",'Product benefit & adoption'!AV45*'Product benefit & adoption'!$N45/1000000,'Product benefit & adoption'!$G$4=\"2015-20\",'Product benefit & adoption'!AV45*'Product benefit & adoption'!$L45/1000000)","v":0},{"$f":"_xlfn.IFS('Product benefit & adoption'!$G$4=\"ALL\",'Product benefit & adoption'!AW45*'Product benefit & adoption'!$P45/1000000,'Product benefit & adoption'!$G$4=\"2020-25\",'Product benefit & adoption'!AW45*'Product benefit & adoption'!$N45/1000000,'Product benefit & adoption'!$G$4=\"2015-20\",'Product benefit & adoption'!AW45*'Product benefit & adoption'!$L45/1000000)","v":0},{"$f":"_xlfn.IFS('Product benefit & adoption'!$G$4=\"ALL\",'Product benefit & adoption'!AX45*'Product benefit & adoption'!$P45/1000000,'Product benefit & adoption'!$G$4=\"2020-25\",'Product benefit & adoption'!AX45*'Product benefit & adoption'!$N45/1000000,'Product benefit & adoption'!$G$4=\"2015-20\",'Product benefit & adoption'!AX45*'Product benefit & adoption'!$L45/1000000)","v":0},{"$f":"_xlfn.IFS('Product benefit & adoption'!$G$4=\"ALL\",'Product benefit & adoption'!AY45*'Product benefit & adoption'!$P45/1000000,'Product benefit & adoption'!$G$4=\"2020-25\",'Product benefit & adoption'!AY45*'Product benefit & adoption'!$N45/1000000,'Product benefit & adoption'!$G$4=\"2015-20\",'Product benefit & adoption'!AY45*'Product benefit & adoption'!$L45/1000000)","v":0},{"$f":"_xlfn.IFS('Product benefit & adoption'!$G$4=\"ALL\",'Product benefit & adoption'!AZ45*'Product benefit & adoption'!$P45/1000000,'Product benefit & adoption'!$G$4=\"2020-25\",'Product benefit & adoption'!AZ45*'Product benefit & adoption'!$N45/1000000,'Product benefit & adoption'!$G$4=\"2015-20\",'Product benefit & adoption'!AZ45*'Product benefit & adoption'!$L45/1000000)","v":0},{"$f":"_xlfn.IFS('Product benefit & adoption'!$G$4=\"ALL\",'Product benefit & adoption'!BA45*'Product benefit & adoption'!$P45/1000000,'Product benefit & adoption'!$G$4=\"2020-25\",'Product benefit & adoption'!BA45*'Product benefit & adoption'!$N45/1000000,'Product benefit & adoption'!$G$4=\"2015-20\",'Product benefit & adoption'!BA45*'Product benefit & adoption'!$L45/1000000)","v":0},{"$f":"_xlfn.IFS('Product benefit & adoption'!$G$4=\"ALL\",'Product benefit & adoption'!BB45*'Product benefit & adoption'!$P45/1000000,'Product benefit & adoption'!$G$4=\"2020-25\",'Product benefit & adoption'!BB45*'Product benefit & adoption'!$N45/1000000,'Product benefit & adoption'!$G$4=\"2015-20\",'Product benefit & adoption'!BB45*'Product benefit & adoption'!$L45/1000000)","v":0},{"$f":"_xlfn.IFS('Product benefit & adoption'!$G$4=\"ALL\",'Product benefit & adoption'!BC45*'Product benefit & adoption'!$P45/1000000,'Product benefit & adoption'!$G$4=\"2020-25\",'Product benefit & adoption'!BC45*'Product benefit & adoption'!$N45/1000000,'Product benefit & adoption'!$G$4=\"2015-20\",'Product benefit & adoption'!BC45*'Product benefit & adoption'!$L45/1000000)","v":0},{"$f":"_xlfn.IFS('Product benefit & adoption'!$G$4=\"ALL\",'Product benefit & adoption'!BD45*'Product benefit & adoption'!$P45/1000000,'Product benefit & adoption'!$G$4=\"2020-25\",'Product benefit & adoption'!BD45*'Product benefit & adoption'!$N45/1000000,'Product benefit & adoption'!$G$4=\"2015-20\",'Product benefit & adoption'!BD45*'Product benefit & adoption'!$L45/1000000)","v":0}]
[null,36,{"$f":"IF('Product benefit & adoption'!D46=\"\",\"\",'Product benefit & adoption'!D46)","v":""},{"$f":"IF('Product benefit & adoption'!F46=\"\",\"\",'Product benefit & adoption'!F46)","v":""},0,{"$f":"_xlfn.IFS('Product benefit & adoption'!$G$4=\"ALL\",'Product benefit & adoption'!AA46*'Product benefit & adoption'!$P46/1000000,'Product benefit & adoption'!$G$4=\"2020-25\",'Product benefit & adoption'!AA46*'Product benefit & adoption'!$N46/1000000,'Product benefit & adoption'!$G$4=\"2015-20\",'Product benefit & adoption'!AA46*'Product benefit & adoption'!$L46/1000000)","v":0},{"$f":"_xlfn.IFS('Product benefit & adoption'!$G$4=\"ALL\",'Product benefit & adoption'!AB46*'Product benefit & adoption'!$P46/1000000,'Product benefit & adoption'!$G$4=\"2020-25\",'Product benefit & adoption'!AB46*'Product benefit & adoption'!$N46/1000000,'Product benefit & adoption'!$G$4=\"2015-20\",'Product benefit & adoption'!AB46*'Product benefit & adoption'!$L46/1000000)","v":0},{"$f":"_xlfn.IFS('Product benefit & adoption'!$G$4=\"ALL\",'Product benefit & adoption'!AC46*'Product benefit & adoption'!$P46/1000000,'Product benefit & adoption'!$G$4=\"2020-25\",'Product benefit & adoption'!AC46*'Product benefit & adoption'!$N46/1000000,'Product benefit & adoption'!$G$4=\"2015-20\",'Product benefit & adoption'!AC46*'Product benefit & adoption'!$L46/1000000)","v":0},{"$f":"_xlfn.IFS('Product benefit & adoption'!$G$4=\"ALL\",'Product benefit & adoption'!AD46*'Product benefit & adoption'!$P46/1000000,'Product benefit & adoption'!$G$4=\"2020-25\",'Product benefit & adoption'!AD46*'Product benefit & adoption'!$N46/1000000,'Product benefit & adoption'!$G$4=\"2015-20\",'Product benefit & adoption'!AD46*'Product benefit & adoption'!$L46/1000000)","v":0},{"$f":"_xlfn.IFS('Product benefit & adoption'!$G$4=\"ALL\",'Product benefit & adoption'!AE46*'Product benefit & adoption'!$P46/1000000,'Product benefit & adoption'!$G$4=\"2020-25\",'Product benefit & adoption'!AE46*'Product benefit & adoption'!$N46/1000000,'Product benefit & adoption'!$G$4=\"2015-20\",'Product benefit & adoption'!AE46*'Product benefit & adoption'!$L46/1000000)","v":0},{"$f":"_xlfn.IFS('Product benefit & adoption'!$G$4=\"ALL\",'Product benefit & adoption'!AF46*'Product benefit & adoption'!$P46/1000000,'Product benefit & adoption'!$G$4=\"2020-25\",'Product benefit & adoption'!AF46*'Product benefit & adoption'!$N46/1000000,'Product benefit & adoption'!$G$4=\"2015-20\",'Product benefit & adoption'!AF46*'Product benefit & adoption'!$L46/1000000)","v":0},{"$f":"_xlfn.IFS('Product benefit & adoption'!$G$4=\"ALL\",'Product benefit & adoption'!AG46*'Product benefit & adoption'!$P46/1000000,'Product benefit & adoption'!$G$4=\"2020-25\",'Product benefit & adoption'!AG46*'Product benefit & adoption'!$N46/1000000,'Product benefit & adoption'!$G$4=\"2015-20\",'Product benefit & adoption'!AG46*'Product benefit & adoption'!$L46/1000000)","v":0},{"$f":"_xlfn.IFS('Product benefit & adoption'!$G$4=\"ALL\",'Product benefit & adoption'!AH46*'Product benefit & adoption'!$P46/1000000,'Product benefit & adoption'!$G$4=\"2020-25\",'Product benefit & adoption'!AH46*'Product benefit & adoption'!$N46/1000000,'Product benefit & adoption'!$G$4=\"2015-20\",'Product benefit & adoption'!AH46*'Product benefit & adoption'!$L46/1000000)","v":0},{"$f":"_xlfn.IFS('Product benefit & adoption'!$G$4=\"ALL\",'Product benefit & adoption'!AI46*'Product benefit & adoption'!$P46/1000000,'Product benefit & adoption'!$G$4=\"2020-25\",'Product benefit & adoption'!AI46*'Product benefit & adoption'!$N46/1000000,'Product benefit & adoption'!$G$4=\"2015-20\",'Product benefit & adoption'!AI46*'Product benefit & adoption'!$L46/1000000)","v":0},{"$f":"_xlfn.IFS('Product benefit & adoption'!$G$4=\"ALL\",'Product benefit & adoption'!AJ46*'Product benefit & adoption'!$P46/1000000,'Product benefit & adoption'!$G$4=\"2020-25\",'Product benefit & adoption'!AJ46*'Product benefit & adoption'!$N46/1000000,'Product benefit & adoption'!$G$4=\"2015-20\",'Product benefit & adoption'!AJ46*'Product benefit & adoption'!$L46/1000000)","v":0},{"$f":"_xlfn.IFS('Product benefit & adoption'!$G$4=\"ALL\",'Product benefit & adoption'!AK46*'Product benefit & adoption'!$P46/1000000,'Product benefit & adoption'!$G$4=\"2020-25\",'Product benefit & adoption'!AK46*'Product benefit & adoption'!$N46/1000000,'Product benefit & adoption'!$G$4=\"2015-20\",'Product benefit & adoption'!AK46*'Product benefit & adoption'!$L46/1000000)","v":0},{"$f":"_xlfn.IFS('Product benefit & adoption'!$G$4=\"ALL\",'Product benefit & adoption'!AL46*'Product benefit & adoption'!$P46/1000000,'Product benefit & adoption'!$G$4=\"2020-25\",'Product benefit & adoption'!AL46*'Product benefit & adoption'!$N46/1000000,'Product benefit & adoption'!$G$4=\"2015-20\",'Product benefit & adoption'!AL46*'Product benefit & adoption'!$L46/1000000)","v":0},{"$f":"_xlfn.IFS('Product benefit & adoption'!$G$4=\"ALL\",'Product benefit & adoption'!AM46*'Product benefit & adoption'!$P46/1000000,'Product benefit & adoption'!$G$4=\"2020-25\",'Product benefit & adoption'!AM46*'Product benefit & adoption'!$N46/1000000,'Product benefit & adoption'!$G$4=\"2015-20\",'Product benefit & adoption'!AM46*'Product benefit & adoption'!$L46/1000000)","v":0},{"$f":"_xlfn.IFS('Product benefit & adoption'!$G$4=\"ALL\",'Product benefit & adoption'!AN46*'Product benefit & adoption'!$P46/1000000,'Product benefit & adoption'!$G$4=\"2020-25\",'Product benefit & adoption'!AN46*'Product benefit & adoption'!$N46/1000000,'Product benefit & adoption'!$G$4=\"2015-20\",'Product benefit & adoption'!AN46*'Product benefit & adoption'!$L46/1000000)","v":0},{"$f":"_xlfn.IFS('Product benefit & adoption'!$G$4=\"ALL\",'Product benefit & adoption'!AO46*'Product benefit & adoption'!$P46/1000000,'Product benefit & adoption'!$G$4=\"2020-25\",'Product benefit & adoption'!AO46*'Product benefit & adoption'!$N46/1000000,'Product benefit & adoption'!$G$4=\"2015-20\",'Product benefit & adoption'!AO46*'Product benefit & adoption'!$L46/1000000)","v":0},{"$f":"_xlfn.IFS('Product benefit & adoption'!$G$4=\"ALL\",'Product benefit & adoption'!AP46*'Product benefit & adoption'!$P46/1000000,'Product benefit & adoption'!$G$4=\"2020-25\",'Product benefit & adoption'!AP46*'Product benefit & adoption'!$N46/1000000,'Product benefit & adoption'!$G$4=\"2015-20\",'Product benefit & adoption'!AP46*'Product benefit & adoption'!$L46/1000000)","v":0},{"$f":"_xlfn.IFS('Product benefit & adoption'!$G$4=\"ALL\",'Product benefit & adoption'!AQ46*'Product benefit & adoption'!$P46/1000000,'Product benefit & adoption'!$G$4=\"2020-25\",'Product benefit & adoption'!AQ46*'Product benefit & adoption'!$N46/1000000,'Product benefit & adoption'!$G$4=\"2015-20\",'Product benefit & adoption'!AQ46*'Product benefit & adoption'!$L46/1000000)","v":0},{"$f":"_xlfn.IFS('Product benefit & adoption'!$G$4=\"ALL\",'Product benefit & adoption'!AR46*'Product benefit & adoption'!$P46/1000000,'Product benefit & adoption'!$G$4=\"2020-25\",'Product benefit & adoption'!AR46*'Product benefit & adoption'!$N46/1000000,'Product benefit & adoption'!$G$4=\"2015-20\",'Product benefit & adoption'!AR46*'Product benefit & adoption'!$L46/1000000)","v":0},{"$f":"_xlfn.IFS('Product benefit & adoption'!$G$4=\"ALL\",'Product benefit & adoption'!AS46*'Product benefit & adoption'!$P46/1000000,'Product benefit & adoption'!$G$4=\"2020-25\",'Product benefit & adoption'!AS46*'Product benefit & adoption'!$N46/1000000,'Product benefit & adoption'!$G$4=\"2015-20\",'Product benefit & adoption'!AS46*'Product benefit & adoption'!$L46/1000000)","v":0},{"$f":"_xlfn.IFS('Product benefit & adoption'!$G$4=\"ALL\",'Product benefit & adoption'!AT46*'Product benefit & adoption'!$P46/1000000,'Product benefit & adoption'!$G$4=\"2020-25\",'Product benefit & adoption'!AT46*'Product benefit & adoption'!$N46/1000000,'Product benefit & adoption'!$G$4=\"2015-20\",'Product benefit & adoption'!AT46*'Product benefit & adoption'!$L46/1000000)","v":0},{"$f":"_xlfn.IFS('Product benefit & adoption'!$G$4=\"ALL\",'Product benefit & adoption'!AU46*'Product benefit & adoption'!$P46/1000000,'Product benefit & adoption'!$G$4=\"2020-25\",'Product benefit & adoption'!AU46*'Product benefit & adoption'!$N46/1000000,'Product benefit & adoption'!$G$4=\"2015-20\",'Product benefit & adoption'!AU46*'Product benefit & adoption'!$L46/1000000)","v":0},{"$f":"_xlfn.IFS('Product benefit & adoption'!$G$4=\"ALL\",'Product benefit & adoption'!AV46*'Product benefit & adoption'!$P46/1000000,'Product benefit & adoption'!$G$4=\"2020-25\",'Product benefit & adoption'!AV46*'Product benefit & adoption'!$N46/1000000,'Product benefit & adoption'!$G$4=\"2015-20\",'Product benefit & adoption'!AV46*'Product benefit & adoption'!$L46/1000000)","v":0},{"$f":"_xlfn.IFS('Product benefit & adoption'!$G$4=\"ALL\",'Product benefit & adoption'!AW46*'Product benefit & adoption'!$P46/1000000,'Product benefit & adoption'!$G$4=\"2020-25\",'Product benefit & adoption'!AW46*'Product benefit & adoption'!$N46/1000000,'Product benefit & adoption'!$G$4=\"2015-20\",'Product benefit & adoption'!AW46*'Product benefit & adoption'!$L46/1000000)","v":0},{"$f":"_xlfn.IFS('Product benefit & adoption'!$G$4=\"ALL\",'Product benefit & adoption'!AX46*'Product benefit & adoption'!$P46/1000000,'Product benefit & adoption'!$G$4=\"2020-25\",'Product benefit & adoption'!AX46*'Product benefit & adoption'!$N46/1000000,'Product benefit & adoption'!$G$4=\"2015-20\",'Product benefit & adoption'!AX46*'Product benefit & adoption'!$L46/1000000)","v":0},{"$f":"_xlfn.IFS('Product benefit & adoption'!$G$4=\"ALL\",'Product benefit & adoption'!AY46*'Product benefit & adoption'!$P46/1000000,'Product benefit & adoption'!$G$4=\"2020-25\",'Product benefit & adoption'!AY46*'Product benefit & adoption'!$N46/1000000,'Product benefit & adoption'!$G$4=\"2015-20\",'Product benefit & adoption'!AY46*'Product benefit & adoption'!$L46/1000000)","v":0},{"$f":"_xlfn.IFS('Product benefit & adoption'!$G$4=\"ALL\",'Product benefit & adoption'!AZ46*'Product benefit & adoption'!$P46/1000000,'Product benefit & adoption'!$G$4=\"2020-25\",'Product benefit & adoption'!AZ46*'Product benefit & adoption'!$N46/1000000,'Product benefit & adoption'!$G$4=\"2015-20\",'Product benefit & adoption'!AZ46*'Product benefit & adoption'!$L46/1000000)","v":0},{"$f":"_xlfn.IFS('Product benefit & adoption'!$G$4=\"ALL\",'Product benefit & adoption'!BA46*'Product benefit & adoption'!$P46/1000000,'Product benefit & adoption'!$G$4=\"2020-25\",'Product benefit & adoption'!BA46*'Product benefit & adoption'!$N46/1000000,'Product benefit & adoption'!$G$4=\"2015-20\",'Product benefit & adoption'!BA46*'Product benefit & adoption'!$L46/1000000)","v":0},{"$f":"_xlfn.IFS('Product benefit & adoption'!$G$4=\"ALL\",'Product benefit & adoption'!BB46*'Product benefit & adoption'!$P46/1000000,'Product benefit & adoption'!$G$4=\"2020-25\",'Product benefit & adoption'!BB46*'Product benefit & adoption'!$N46/1000000,'Product benefit & adoption'!$G$4=\"2015-20\",'Product benefit & adoption'!BB46*'Product benefit & adoption'!$L46/1000000)","v":0},{"$f":"_xlfn.IFS('Product benefit & adoption'!$G$4=\"ALL\",'Product benefit & adoption'!BC46*'Product benefit & adoption'!$P46/1000000,'Product benefit & adoption'!$G$4=\"2020-25\",'Product benefit & adoption'!BC46*'Product benefit & adoption'!$N46/1000000,'Product benefit & adoption'!$G$4=\"2015-20\",'Product benefit & adoption'!BC46*'Product benefit & adoption'!$L46/1000000)","v":0},{"$f":"_xlfn.IFS('Product benefit & adoption'!$G$4=\"ALL\",'Product benefit & adoption'!BD46*'Product benefit & adoption'!$P46/1000000,'Product benefit & adoption'!$G$4=\"2020-25\",'Product benefit & adoption'!BD46*'Product benefit & adoption'!$N46/1000000,'Product benefit & adoption'!$G$4=\"2015-20\",'Product benefit & adoption'!BD46*'Product benefit & adoption'!$L46/1000000)","v":0}]
[null,37,{"$f":"IF('Product benefit & adoption'!D47=\"\",\"\",'Product benefit & adoption'!D47)","v":""},{"$f":"IF('Product benefit & adoption'!F47=\"\",\"\",'Product benefit & adoption'!F47)","v":""},0,{"$f":"_xlfn.IFS('Product benefit & adoption'!$G$4=\"ALL\",'Product benefit & adoption'!AA47*'Product benefit & adoption'!$P47/1000000,'Product benefit & adoption'!$G$4=\"2020-25\",'Product benefit & adoption'!AA47*'Product benefit & adoption'!$N47/1000000,'Product benefit & adoption'!$G$4=\"2015-20\",'Product benefit & adoption'!AA47*'Product benefit & adoption'!$L47/1000000)","v":0},{"$f":"_xlfn.IFS('Product benefit & adoption'!$G$4=\"ALL\",'Product benefit & adoption'!AB47*'Product benefit & adoption'!$P47/1000000,'Product benefit & adoption'!$G$4=\"2020-25\",'Product benefit & adoption'!AB47*'Product benefit & adoption'!$N47/1000000,'Product benefit & adoption'!$G$4=\"2015-20\",'Product benefit & adoption'!AB47*'Product benefit & adoption'!$L47/1000000)","v":0},{"$f":"_xlfn.IFS('Product benefit & adoption'!$G$4=\"ALL\",'Product benefit & adoption'!AC47*'Product benefit & adoption'!$P47/1000000,'Product benefit & adoption'!$G$4=\"2020-25\",'Product benefit & adoption'!AC47*'Product benefit & adoption'!$N47/1000000,'Product benefit & adoption'!$G$4=\"2015-20\",'Product benefit & adoption'!AC47*'Product benefit & adoption'!$L47/1000000)","v":0},{"$f":"_xlfn.IFS('Product benefit & adoption'!$G$4=\"ALL\",'Product benefit & adoption'!AD47*'Product benefit & adoption'!$P47/1000000,'Product benefit & adoption'!$G$4=\"2020-25\",'Product benefit & adoption'!AD47*'Product benefit & adoption'!$N47/1000000,'Product benefit & adoption'!$G$4=\"2015-20\",'Product benefit & adoption'!AD47*'Product benefit & adoption'!$L47/1000000)","v":0},{"$f":"_xlfn.IFS('Product benefit & adoption'!$G$4=\"ALL\",'Product benefit & adoption'!AE47*'Product benefit & adoption'!$P47/1000000,'Product benefit & adoption'!$G$4=\"2020-25\",'Product benefit & adoption'!AE47*'Product benefit & adoption'!$N47/1000000,'Product benefit & adoption'!$G$4=\"2015-20\",'Product benefit & adoption'!AE47*'Product benefit & adoption'!$L47/1000000)","v":0},{"$f":"_xlfn.IFS('Product benefit & adoption'!$G$4=\"ALL\",'Product benefit & adoption'!AF47*'Product benefit & adoption'!$P47/1000000,'Product benefit & adoption'!$G$4=\"2020-25\",'Product benefit & adoption'!AF47*'Product benefit & adoption'!$N47/1000000,'Product benefit & adoption'!$G$4=\"2015-20\",'Product benefit & adoption'!AF47*'Product benefit & adoption'!$L47/1000000)","v":0},{"$f":"_xlfn.IFS('Product benefit & adoption'!$G$4=\"ALL\",'Product benefit & adoption'!AG47*'Product benefit & adoption'!$P47/1000000,'Product benefit & adoption'!$G$4=\"2020-25\",'Product benefit & adoption'!AG47*'Product benefit & adoption'!$N47/1000000,'Product benefit & adoption'!$G$4=\"2015-20\",'Product benefit & adoption'!AG47*'Product benefit & adoption'!$L47/1000000)","v":0},{"$f":"_xlfn.IFS('Product benefit & adoption'!$G$4=\"ALL\",'Product benefit & adoption'!AH47*'Product benefit & adoption'!$P47/1000000,'Product benefit & adoption'!$G$4=\"2020-25\",'Product benefit & adoption'!AH47*'Product benefit & adoption'!$N47/1000000,'Product benefit & adoption'!$G$4=\"2015-20\",'Product benefit & adoption'!AH47*'Product benefit & adoption'!$L47/1000000)","v":0},{"$f":"_xlfn.IFS('Product benefit & adoption'!$G$4=\"ALL\",'Product benefit & adoption'!AI47*'Product benefit & adoption'!$P47/1000000,'Product benefit & adoption'!$G$4=\"2020-25\",'Product benefit & adoption'!AI47*'Product benefit & adoption'!$N47/1000000,'Product benefit & adoption'!$G$4=\"2015-20\",'Product benefit & adoption'!AI47*'Product benefit & adoption'!$L47/1000000)","v":0},{"$f":"_xlfn.IFS('Product benefit & adoption'!$G$4=\"ALL\",'Product benefit & adoption'!AJ47*'Product benefit & adoption'!$P47/1000000,'Product benefit & adoption'!$G$4=\"2020-25\",'Product benefit & adoption'!AJ47*'Product benefit & adoption'!$N47/1000000,'Product benefit & adoption'!$G$4=\"2015-20\",'Product benefit & adoption'!AJ47*'Product benefit & adoption'!$L47/1000000)","v":0},{"$f":"_xlfn.IFS('Product benefit & adoption'!$G$4=\"ALL\",'Product benefit & adoption'!AK47*'Product benefit & adoption'!$P47/1000000,'Product benefit & adoption'!$G$4=\"2020-25\",'Product benefit & adoption'!AK47*'Product benefit & adoption'!$N47/1000000,'Product benefit & adoption'!$G$4=\"2015-20\",'Product benefit & adoption'!AK47*'Product benefit & adoption'!$L47/1000000)","v":0},{"$f":"_xlfn.IFS('Product benefit & adoption'!$G$4=\"ALL\",'Product benefit & adoption'!AL47*'Product benefit & adoption'!$P47/1000000,'Product benefit & adoption'!$G$4=\"2020-25\",'Product benefit & adoption'!AL47*'Product benefit & adoption'!$N47/1000000,'Product benefit & adoption'!$G$4=\"2015-20\",'Product benefit & adoption'!AL47*'Product benefit & adoption'!$L47/1000000)","v":0},{"$f":"_xlfn.IFS('Product benefit & adoption'!$G$4=\"ALL\",'Product benefit & adoption'!AM47*'Product benefit & adoption'!$P47/1000000,'Product benefit & adoption'!$G$4=\"2020-25\",'Product benefit & adoption'!AM47*'Product benefit & adoption'!$N47/1000000,'Product benefit & adoption'!$G$4=\"2015-20\",'Product benefit & adoption'!AM47*'Product benefit & adoption'!$L47/1000000)","v":0},{"$f":"_xlfn.IFS('Product benefit & adoption'!$G$4=\"ALL\",'Product benefit & adoption'!AN47*'Product benefit & adoption'!$P47/1000000,'Product benefit & adoption'!$G$4=\"2020-25\",'Product benefit & adoption'!AN47*'Product benefit & adoption'!$N47/1000000,'Product benefit & adoption'!$G$4=\"2015-20\",'Product benefit & adoption'!AN47*'Product benefit & adoption'!$L47/1000000)","v":0},{"$f":"_xlfn.IFS('Product benefit & adoption'!$G$4=\"ALL\",'Product benefit & adoption'!AO47*'Product benefit & adoption'!$P47/1000000,'Product benefit & adoption'!$G$4=\"2020-25\",'Product benefit & adoption'!AO47*'Product benefit & adoption'!$N47/1000000,'Product benefit & adoption'!$G$4=\"2015-20\",'Product benefit & adoption'!AO47*'Product benefit & adoption'!$L47/1000000)","v":0},{"$f":"_xlfn.IFS('Product benefit & adoption'!$G$4=\"ALL\",'Product benefit & adoption'!AP47*'Product benefit & adoption'!$P47/1000000,'Product benefit & adoption'!$G$4=\"2020-25\",'Product benefit & adoption'!AP47*'Product benefit & adoption'!$N47/1000000,'Product benefit & adoption'!$G$4=\"2015-20\",'Product benefit & adoption'!AP47*'Product benefit & adoption'!$L47/1000000)","v":0},{"$f":"_xlfn.IFS('Product benefit & adoption'!$G$4=\"ALL\",'Product benefit & adoption'!AQ47*'Product benefit & adoption'!$P47/1000000,'Product benefit & adoption'!$G$4=\"2020-25\",'Product benefit & adoption'!AQ47*'Product benefit & adoption'!$N47/1000000,'Product benefit & adoption'!$G$4=\"2015-20\",'Product benefit & adoption'!AQ47*'Product benefit & adoption'!$L47/1000000)","v":0},{"$f":"_xlfn.IFS('Product benefit & adoption'!$G$4=\"ALL\",'Product benefit & adoption'!AR47*'Product benefit & adoption'!$P47/1000000,'Product benefit & adoption'!$G$4=\"2020-25\",'Product benefit & adoption'!AR47*'Product benefit & adoption'!$N47/1000000,'Product benefit & adoption'!$G$4=\"2015-20\",'Product benefit & adoption'!AR47*'Product benefit & adoption'!$L47/1000000)","v":0},{"$f":"_xlfn.IFS('Product benefit & adoption'!$G$4=\"ALL\",'Product benefit & adoption'!AS47*'Product benefit & adoption'!$P47/1000000,'Product benefit & adoption'!$G$4=\"2020-25\",'Product benefit & adoption'!AS47*'Product benefit & adoption'!$N47/1000000,'Product benefit & adoption'!$G$4=\"2015-20\",'Product benefit & adoption'!AS47*'Product benefit & adoption'!$L47/1000000)","v":0},{"$f":"_xlfn.IFS('Product benefit & adoption'!$G$4=\"ALL\",'Product benefit & adoption'!AT47*'Product benefit & adoption'!$P47/1000000,'Product benefit & adoption'!$G$4=\"2020-25\",'Product benefit & adoption'!AT47*'Product benefit & adoption'!$N47/1000000,'Product benefit & adoption'!$G$4=\"2015-20\",'Product benefit & adoption'!AT47*'Product benefit & adoption'!$L47/1000000)","v":0},{"$f":"_xlfn.IFS('Product benefit & adoption'!$G$4=\"ALL\",'Product benefit & adoption'!AU47*'Product benefit & adoption'!$P47/1000000,'Product benefit & adoption'!$G$4=\"2020-25\",'Product benefit & adoption'!AU47*'Product benefit & adoption'!$N47/1000000,'Product benefit & adoption'!$G$4=\"2015-20\",'Product benefit & adoption'!AU47*'Product benefit & adoption'!$L47/1000000)","v":0},{"$f":"_xlfn.IFS('Product benefit & adoption'!$G$4=\"ALL\",'Product benefit & adoption'!AV47*'Product benefit & adoption'!$P47/1000000,'Product benefit & adoption'!$G$4=\"2020-25\",'Product benefit & adoption'!AV47*'Product benefit & adoption'!$N47/1000000,'Product benefit & adoption'!$G$4=\"2015-20\",'Product benefit & adoption'!AV47*'Product benefit & adoption'!$L47/1000000)","v":0},{"$f":"_xlfn.IFS('Product benefit & adoption'!$G$4=\"ALL\",'Product benefit & adoption'!AW47*'Product benefit & adoption'!$P47/1000000,'Product benefit & adoption'!$G$4=\"2020-25\",'Product benefit & adoption'!AW47*'Product benefit & adoption'!$N47/1000000,'Product benefit & adoption'!$G$4=\"2015-20\",'Product benefit & adoption'!AW47*'Product benefit & adoption'!$L47/1000000)","v":0},{"$f":"_xlfn.IFS('Product benefit & adoption'!$G$4=\"ALL\",'Product benefit & adoption'!AX47*'Product benefit & adoption'!$P47/1000000,'Product benefit & adoption'!$G$4=\"2020-25\",'Product benefit & adoption'!AX47*'Product benefit & adoption'!$N47/1000000,'Product benefit & adoption'!$G$4=\"2015-20\",'Product benefit & adoption'!AX47*'Product benefit & adoption'!$L47/1000000)","v":0},{"$f":"_xlfn.IFS('Product benefit & adoption'!$G$4=\"ALL\",'Product benefit & adoption'!AY47*'Product benefit & adoption'!$P47/1000000,'Product benefit & adoption'!$G$4=\"2020-25\",'Product benefit & adoption'!AY47*'Product benefit & adoption'!$N47/1000000,'Product benefit & adoption'!$G$4=\"2015-20\",'Product benefit & adoption'!AY47*'Product benefit & adoption'!$L47/1000000)","v":0},{"$f":"_xlfn.IFS('Product benefit & adoption'!$G$4=\"ALL\",'Product benefit & adoption'!AZ47*'Product benefit & adoption'!$P47/1000000,'Product benefit & adoption'!$G$4=\"2020-25\",'Product benefit & adoption'!AZ47*'Product benefit & adoption'!$N47/1000000,'Product benefit & adoption'!$G$4=\"2015-20\",'Product benefit & adoption'!AZ47*'Product benefit & adoption'!$L47/1000000)","v":0},{"$f":"_xlfn.IFS('Product benefit & adoption'!$G$4=\"ALL\",'Product benefit & adoption'!BA47*'Product benefit & adoption'!$P47/1000000,'Product benefit & adoption'!$G$4=\"2020-25\",'Product benefit & adoption'!BA47*'Product benefit & adoption'!$N47/1000000,'Product benefit & adoption'!$G$4=\"2015-20\",'Product benefit & adoption'!BA47*'Product benefit & adoption'!$L47/1000000)","v":0},{"$f":"_xlfn.IFS('Product benefit & adoption'!$G$4=\"ALL\",'Product benefit & adoption'!BB47*'Product benefit & adoption'!$P47/1000000,'Product benefit & adoption'!$G$4=\"2020-25\",'Product benefit & adoption'!BB47*'Product benefit & adoption'!$N47/1000000,'Product benefit & adoption'!$G$4=\"2015-20\",'Product benefit & adoption'!BB47*'Product benefit & adoption'!$L47/1000000)","v":0},{"$f":"_xlfn.IFS('Product benefit & adoption'!$G$4=\"ALL\",'Product benefit & adoption'!BC47*'Product benefit & adoption'!$P47/1000000,'Product benefit & adoption'!$G$4=\"2020-25\",'Product benefit & adoption'!BC47*'Product benefit & adoption'!$N47/1000000,'Product benefit & adoption'!$G$4=\"2015-20\",'Product benefit & adoption'!BC47*'Product benefit & adoption'!$L47/1000000)","v":0},{"$f":"_xlfn.IFS('Product benefit & adoption'!$G$4=\"ALL\",'Product benefit & adoption'!BD47*'Product benefit & adoption'!$P47/1000000,'Product benefit & adoption'!$G$4=\"2020-25\",'Product benefit & adoption'!BD47*'Product benefit & adoption'!$N47/1000000,'Product benefit & adoption'!$G$4=\"2015-20\",'Product benefit & adoption'!BD47*'Product benefit & adoption'!$L47/1000000)","v":0}]
[null,38,{"$f":"IF('Product benefit & adoption'!D48=\"\",\"\",'Product benefit & adoption'!D48)","v":""},{"$f":"IF('Product benefit & adoption'!F48=\"\",\"\",'Product benefit & adoption'!F48)","v":""},0,{"$f":"_xlfn.IFS('Product benefit & adoption'!$G$4=\"ALL\",'Product benefit & adoption'!AA48*'Product benefit & adoption'!$P48/1000000,'Product benefit & adoption'!$G$4=\"2020-25\",'Product benefit & adoption'!AA48*'Product benefit & adoption'!$N48/1000000,'Product benefit & adoption'!$G$4=\"2015-20\",'Product benefit & adoption'!AA48*'Product benefit & adoption'!$L48/1000000)","v":0},{"$f":"_xlfn.IFS('Product benefit & adoption'!$G$4=\"ALL\",'Product benefit & adoption'!AB48*'Product benefit & adoption'!$P48/1000000,'Product benefit & adoption'!$G$4=\"2020-25\",'Product benefit & adoption'!AB48*'Product benefit & adoption'!$N48/1000000,'Product benefit & adoption'!$G$4=\"2015-20\",'Product benefit & adoption'!AB48*'Product benefit & adoption'!$L48/1000000)","v":0},{"$f":"_xlfn.IFS('Product benefit & adoption'!$G$4=\"ALL\",'Product benefit & adoption'!AC48*'Product benefit & adoption'!$P48/1000000,'Product benefit & adoption'!$G$4=\"2020-25\",'Product benefit & adoption'!AC48*'Product benefit & adoption'!$N48/1000000,'Product benefit & adoption'!$G$4=\"2015-20\",'Product benefit & adoption'!AC48*'Product benefit & adoption'!$L48/1000000)","v":0},{"$f":"_xlfn.IFS('Product benefit & adoption'!$G$4=\"ALL\",'Product benefit & adoption'!AD48*'Product benefit & adoption'!$P48/1000000,'Product benefit & adoption'!$G$4=\"2020-25\",'Product benefit & adoption'!AD48*'Product benefit & adoption'!$N48/1000000,'Product benefit & adoption'!$G$4=\"2015-20\",'Product benefit & adoption'!AD48*'Product benefit & adoption'!$L48/1000000)","v":0},{"$f":"_xlfn.IFS('Product benefit & adoption'!$G$4=\"ALL\",'Product benefit & adoption'!AE48*'Product benefit & adoption'!$P48/1000000,'Product benefit & adoption'!$G$4=\"2020-25\",'Product benefit & adoption'!AE48*'Product benefit & adoption'!$N48/1000000,'Product benefit & adoption'!$G$4=\"2015-20\",'Product benefit & adoption'!AE48*'Product benefit & adoption'!$L48/1000000)","v":0},{"$f":"_xlfn.IFS('Product benefit & adoption'!$G$4=\"ALL\",'Product benefit & adoption'!AF48*'Product benefit & adoption'!$P48/1000000,'Product benefit & adoption'!$G$4=\"2020-25\",'Product benefit & adoption'!AF48*'Product benefit & adoption'!$N48/1000000,'Product benefit & adoption'!$G$4=\"2015-20\",'Product benefit & adoption'!AF48*'Product benefit & adoption'!$L48/1000000)","v":0},{"$f":"_xlfn.IFS('Product benefit & adoption'!$G$4=\"ALL\",'Product benefit & adoption'!AG48*'Product benefit & adoption'!$P48/1000000,'Product benefit & adoption'!$G$4=\"2020-25\",'Product benefit & adoption'!AG48*'Product benefit & adoption'!$N48/1000000,'Product benefit & adoption'!$G$4=\"2015-20\",'Product benefit & adoption'!AG48*'Product benefit & adoption'!$L48/1000000)","v":0},{"$f":"_xlfn.IFS('Product benefit & adoption'!$G$4=\"ALL\",'Product benefit & adoption'!AH48*'Product benefit & adoption'!$P48/1000000,'Product benefit & adoption'!$G$4=\"2020-25\",'Product benefit & adoption'!AH48*'Product benefit & adoption'!$N48/1000000,'Product benefit & adoption'!$G$4=\"2015-20\",'Product benefit & adoption'!AH48*'Product benefit & adoption'!$L48/1000000)","v":0},{"$f":"_xlfn.IFS('Product benefit & adoption'!$G$4=\"ALL\",'Product benefit & adoption'!AI48*'Product benefit & adoption'!$P48/1000000,'Product benefit & adoption'!$G$4=\"2020-25\",'Product benefit & adoption'!AI48*'Product benefit & adoption'!$N48/1000000,'Product benefit & adoption'!$G$4=\"2015-20\",'Product benefit & adoption'!AI48*'Product benefit & adoption'!$L48/1000000)","v":0},{"$f":"_xlfn.IFS('Product benefit & adoption'!$G$4=\"ALL\",'Product benefit & adoption'!AJ48*'Product benefit & adoption'!$P48/1000000,'Product benefit & adoption'!$G$4=\"2020-25\",'Product benefit & adoption'!AJ48*'Product benefit & adoption'!$N48/1000000,'Product benefit & adoption'!$G$4=\"2015-20\",'Product benefit & adoption'!AJ48*'Product benefit & adoption'!$L48/1000000)","v":0},{"$f":"_xlfn.IFS('Product benefit & adoption'!$G$4=\"ALL\",'Product benefit & adoption'!AK48*'Product benefit & adoption'!$P48/1000000,'Product benefit & adoption'!$G$4=\"2020-25\",'Product benefit & adoption'!AK48*'Product benefit & adoption'!$N48/1000000,'Product benefit & adoption'!$G$4=\"2015-20\",'Product benefit & adoption'!AK48*'Product benefit & adoption'!$L48/1000000)","v":0},{"$f":"_xlfn.IFS('Product benefit & adoption'!$G$4=\"ALL\",'Product benefit & adoption'!AL48*'Product benefit & adoption'!$P48/1000000,'Product benefit & adoption'!$G$4=\"2020-25\",'Product benefit & adoption'!AL48*'Product benefit & adoption'!$N48/1000000,'Product benefit & adoption'!$G$4=\"2015-20\",'Product benefit & adoption'!AL48*'Product benefit & adoption'!$L48/1000000)","v":0},{"$f":"_xlfn.IFS('Product benefit & adoption'!$G$4=\"ALL\",'Product benefit & adoption'!AM48*'Product benefit & adoption'!$P48/1000000,'Product benefit & adoption'!$G$4=\"2020-25\",'Product benefit & adoption'!AM48*'Product benefit & adoption'!$N48/1000000,'Product benefit & adoption'!$G$4=\"2015-20\",'Product benefit & adoption'!AM48*'Product benefit & adoption'!$L48/1000000)","v":0},{"$f":"_xlfn.IFS('Product benefit & adoption'!$G$4=\"ALL\",'Product benefit & adoption'!AN48*'Product benefit & adoption'!$P48/1000000,'Product benefit & adoption'!$G$4=\"2020-25\",'Product benefit & adoption'!AN48*'Product benefit & adoption'!$N48/1000000,'Product benefit & adoption'!$G$4=\"2015-20\",'Product benefit & adoption'!AN48*'Product benefit & adoption'!$L48/1000000)","v":0},{"$f":"_xlfn.IFS('Product benefit & adoption'!$G$4=\"ALL\",'Product benefit & adoption'!AO48*'Product benefit & adoption'!$P48/1000000,'Product benefit & adoption'!$G$4=\"2020-25\",'Product benefit & adoption'!AO48*'Product benefit & adoption'!$N48/1000000,'Product benefit & adoption'!$G$4=\"2015-20\",'Product benefit & adoption'!AO48*'Product benefit & adoption'!$L48/1000000)","v":0},{"$f":"_xlfn.IFS('Product benefit & adoption'!$G$4=\"ALL\",'Product benefit & adoption'!AP48*'Product benefit & adoption'!$P48/1000000,'Product benefit & adoption'!$G$4=\"2020-25\",'Product benefit & adoption'!AP48*'Product benefit & adoption'!$N48/1000000,'Product benefit & adoption'!$G$4=\"2015-20\",'Product benefit & adoption'!AP48*'Product benefit & adoption'!$L48/1000000)","v":0},{"$f":"_xlfn.IFS('Product benefit & adoption'!$G$4=\"ALL\",'Product benefit & adoption'!AQ48*'Product benefit & adoption'!$P48/1000000,'Product benefit & adoption'!$G$4=\"2020-25\",'Product benefit & adoption'!AQ48*'Product benefit & adoption'!$N48/1000000,'Product benefit & adoption'!$G$4=\"2015-20\",'Product benefit & adoption'!AQ48*'Product benefit & adoption'!$L48/1000000)","v":0},{"$f":"_xlfn.IFS('Product benefit & adoption'!$G$4=\"ALL\",'Product benefit & adoption'!AR48*'Product benefit & adoption'!$P48/1000000,'Product benefit & adoption'!$G$4=\"2020-25\",'Product benefit & adoption'!AR48*'Product benefit & adoption'!$N48/1000000,'Product benefit & adoption'!$G$4=\"2015-20\",'Product benefit & adoption'!AR48*'Product benefit & adoption'!$L48/1000000)","v":0},{"$f":"_xlfn.IFS('Product benefit & adoption'!$G$4=\"ALL\",'Product benefit & adoption'!AS48*'Product benefit & adoption'!$P48/1000000,'Product benefit & adoption'!$G$4=\"2020-25\",'Product benefit & adoption'!AS48*'Product benefit & adoption'!$N48/1000000,'Product benefit & adoption'!$G$4=\"2015-20\",'Product benefit & adoption'!AS48*'Product benefit & adoption'!$L48/1000000)","v":0},{"$f":"_xlfn.IFS('Product benefit & adoption'!$G$4=\"ALL\",'Product benefit & adoption'!AT48*'Product benefit & adoption'!$P48/1000000,'Product benefit & adoption'!$G$4=\"2020-25\",'Product benefit & adoption'!AT48*'Product benefit & adoption'!$N48/1000000,'Product benefit & adoption'!$G$4=\"2015-20\",'Product benefit & adoption'!AT48*'Product benefit & adoption'!$L48/1000000)","v":0},{"$f":"_xlfn.IFS('Product benefit & adoption'!$G$4=\"ALL\",'Product benefit & adoption'!AU48*'Product benefit & adoption'!$P48/1000000,'Product benefit & adoption'!$G$4=\"2020-25\",'Product benefit & adoption'!AU48*'Product benefit & adoption'!$N48/1000000,'Product benefit & adoption'!$G$4=\"2015-20\",'Product benefit & adoption'!AU48*'Product benefit & adoption'!$L48/1000000)","v":0},{"$f":"_xlfn.IFS('Product benefit & adoption'!$G$4=\"ALL\",'Product benefit & adoption'!AV48*'Product benefit & adoption'!$P48/1000000,'Product benefit & adoption'!$G$4=\"2020-25\",'Product benefit & adoption'!AV48*'Product benefit & adoption'!$N48/1000000,'Product benefit & adoption'!$G$4=\"2015-20\",'Product benefit & adoption'!AV48*'Product benefit & adoption'!$L48/1000000)","v":0},{"$f":"_xlfn.IFS('Product benefit & adoption'!$G$4=\"ALL\",'Product benefit & adoption'!AW48*'Product benefit & adoption'!$P48/1000000,'Product benefit & adoption'!$G$4=\"2020-25\",'Product benefit & adoption'!AW48*'Product benefit & adoption'!$N48/1000000,'Product benefit & adoption'!$G$4=\"2015-20\",'Product benefit & adoption'!AW48*'Product benefit & adoption'!$L48/1000000)","v":0},{"$f":"_xlfn.IFS('Product benefit & adoption'!$G$4=\"ALL\",'Product benefit & adoption'!AX48*'Product benefit & adoption'!$P48/1000000,'Product benefit & adoption'!$G$4=\"2020-25\",'Product benefit & adoption'!AX48*'Product benefit & adoption'!$N48/1000000,'Product benefit & adoption'!$G$4=\"2015-20\",'Product benefit & adoption'!AX48*'Product benefit & adoption'!$L48/1000000)","v":0},{"$f":"_xlfn.IFS('Product benefit & adoption'!$G$4=\"ALL\",'Product benefit & adoption'!AY48*'Product benefit & adoption'!$P48/1000000,'Product benefit & adoption'!$G$4=\"2020-25\",'Product benefit & adoption'!AY48*'Product benefit & adoption'!$N48/1000000,'Product benefit & adoption'!$G$4=\"2015-20\",'Product benefit & adoption'!AY48*'Product benefit & adoption'!$L48/1000000)","v":0},{"$f":"_xlfn.IFS('Product benefit & adoption'!$G$4=\"ALL\",'Product benefit & adoption'!AZ48*'Product benefit & adoption'!$P48/1000000,'Product benefit & adoption'!$G$4=\"2020-25\",'Product benefit & adoption'!AZ48*'Product benefit & adoption'!$N48/1000000,'Product benefit & adoption'!$G$4=\"2015-20\",'Product benefit & adoption'!AZ48*'Product benefit & adoption'!$L48/1000000)","v":0},{"$f":"_xlfn.IFS('Product benefit & adoption'!$G$4=\"ALL\",'Product benefit & adoption'!BA48*'Product benefit & adoption'!$P48/1000000,'Product benefit & adoption'!$G$4=\"2020-25\",'Product benefit & adoption'!BA48*'Product benefit & adoption'!$N48/1000000,'Product benefit & adoption'!$G$4=\"2015-20\",'Product benefit & adoption'!BA48*'Product benefit & adoption'!$L48/1000000)","v":0},{"$f":"_xlfn.IFS('Product benefit & adoption'!$G$4=\"ALL\",'Product benefit & adoption'!BB48*'Product benefit & adoption'!$P48/1000000,'Product benefit & adoption'!$G$4=\"2020-25\",'Product benefit & adoption'!BB48*'Product benefit & adoption'!$N48/1000000,'Product benefit & adoption'!$G$4=\"2015-20\",'Product benefit & adoption'!BB48*'Product benefit & adoption'!$L48/1000000)","v":0},{"$f":"_xlfn.IFS('Product benefit & adoption'!$G$4=\"ALL\",'Product benefit & adoption'!BC48*'Product benefit & adoption'!$P48/1000000,'Product benefit & adoption'!$G$4=\"2020-25\",'Product benefit & adoption'!BC48*'Product benefit & adoption'!$N48/1000000,'Product benefit & adoption'!$G$4=\"2015-20\",'Product benefit & adoption'!BC48*'Product benefit & adoption'!$L48/1000000)","v":0},{"$f":"_xlfn.IFS('Product benefit & adoption'!$G$4=\"ALL\",'Product benefit & adoption'!BD48*'Product benefit & adoption'!$P48/1000000,'Product benefit & adoption'!$G$4=\"2020-25\",'Product benefit & adoption'!BD48*'Product benefit & adoption'!$N48/1000000,'Product benefit & adoption'!$G$4=\"2015-20\",'Product benefit & adoption'!BD48*'Product benefit & adoption'!$L48/1000000)","v":0}]
[null,39,{"$f":"IF('Product benefit & adoption'!D49=\"\",\"\",'Product benefit & adoption'!D49)","v":""},{"$f":"IF('Product benefit & adoption'!F49=\"\",\"\",'Product benefit & adoption'!F49)","v":""},0,{"$f":"_xlfn.IFS('Product benefit & adoption'!$G$4=\"ALL\",'Product benefit & adoption'!AA49*'Product benefit & adoption'!$P49/1000000,'Product benefit & adoption'!$G$4=\"2020-25\",'Product benefit & adoption'!AA49*'Product benefit & adoption'!$N49/1000000,'Product benefit & adoption'!$G$4=\"2015-20\",'Product benefit & adoption'!AA49*'Product benefit & adoption'!$L49/1000000)","v":0},{"$f":"_xlfn.IFS('Product benefit & adoption'!$G$4=\"ALL\",'Product benefit & adoption'!AB49*'Product benefit & adoption'!$P49/1000000,'Product benefit & adoption'!$G$4=\"2020-25\",'Product benefit & adoption'!AB49*'Product benefit & adoption'!$N49/1000000,'Product benefit & adoption'!$G$4=\"2015-20\",'Product benefit & adoption'!AB49*'Product benefit & adoption'!$L49/1000000)","v":0},{"$f":"_xlfn.IFS('Product benefit & adoption'!$G$4=\"ALL\",'Product benefit & adoption'!AC49*'Product benefit & adoption'!$P49/1000000,'Product benefit & adoption'!$G$4=\"2020-25\",'Product benefit & adoption'!AC49*'Product benefit & adoption'!$N49/1000000,'Product benefit & adoption'!$G$4=\"2015-20\",'Product benefit & adoption'!AC49*'Product benefit & adoption'!$L49/1000000)","v":0},{"$f":"_xlfn.IFS('Product benefit & adoption'!$G$4=\"ALL\",'Product benefit & adoption'!AD49*'Product benefit & adoption'!$P49/1000000,'Product benefit & adoption'!$G$4=\"2020-25\",'Product benefit & adoption'!AD49*'Product benefit & adoption'!$N49/1000000,'Product benefit & adoption'!$G$4=\"2015-20\",'Product benefit & adoption'!AD49*'Product benefit & adoption'!$L49/1000000)","v":0},{"$f":"_xlfn.IFS('Product benefit & adoption'!$G$4=\"ALL\",'Product benefit & adoption'!AE49*'Product benefit & adoption'!$P49/1000000,'Product benefit & adoption'!$G$4=\"2020-25\",'Product benefit & adoption'!AE49*'Product benefit & adoption'!$N49/1000000,'Product benefit & adoption'!$G$4=\"2015-20\",'Product benefit & adoption'!AE49*'Product benefit & adoption'!$L49/1000000)","v":0},{"$f":"_xlfn.IFS('Product benefit & adoption'!$G$4=\"ALL\",'Product benefit & adoption'!AF49*'Product benefit & adoption'!$P49/1000000,'Product benefit & adoption'!$G$4=\"2020-25\",'Product benefit & adoption'!AF49*'Product benefit & adoption'!$N49/1000000,'Product benefit & adoption'!$G$4=\"2015-20\",'Product benefit & adoption'!AF49*'Product benefit & adoption'!$L49/1000000)","v":0},{"$f":"_xlfn.IFS('Product benefit & adoption'!$G$4=\"ALL\",'Product benefit & adoption'!AG49*'Product benefit & adoption'!$P49/1000000,'Product benefit & adoption'!$G$4=\"2020-25\",'Product benefit & adoption'!AG49*'Product benefit & adoption'!$N49/1000000,'Product benefit & adoption'!$G$4=\"2015-20\",'Product benefit & adoption'!AG49*'Product benefit & adoption'!$L49/1000000)","v":0},{"$f":"_xlfn.IFS('Product benefit & adoption'!$G$4=\"ALL\",'Product benefit & adoption'!AH49*'Product benefit & adoption'!$P49/1000000,'Product benefit & adoption'!$G$4=\"2020-25\",'Product benefit & adoption'!AH49*'Product benefit & adoption'!$N49/1000000,'Product benefit & adoption'!$G$4=\"2015-20\",'Product benefit & adoption'!AH49*'Product benefit & adoption'!$L49/1000000)","v":0},{"$f":"_xlfn.IFS('Product benefit & adoption'!$G$4=\"ALL\",'Product benefit & adoption'!AI49*'Product benefit & adoption'!$P49/1000000,'Product benefit & adoption'!$G$4=\"2020-25\",'Product benefit & adoption'!AI49*'Product benefit & adoption'!$N49/1000000,'Product benefit & adoption'!$G$4=\"2015-20\",'Product benefit & adoption'!AI49*'Product benefit & adoption'!$L49/1000000)","v":0},{"$f":"_xlfn.IFS('Product benefit & adoption'!$G$4=\"ALL\",'Product benefit & adoption'!AJ49*'Product benefit & adoption'!$P49/1000000,'Product benefit & adoption'!$G$4=\"2020-25\",'Product benefit & adoption'!AJ49*'Product benefit & adoption'!$N49/1000000,'Product benefit & adoption'!$G$4=\"2015-20\",'Product benefit & adoption'!AJ49*'Product benefit & adoption'!$L49/1000000)","v":0},{"$f":"_xlfn.IFS('Product benefit & adoption'!$G$4=\"ALL\",'Product benefit & adoption'!AK49*'Product benefit & adoption'!$P49/1000000,'Product benefit & adoption'!$G$4=\"2020-25\",'Product benefit & adoption'!AK49*'Product benefit & adoption'!$N49/1000000,'Product benefit & adoption'!$G$4=\"2015-20\",'Product benefit & adoption'!AK49*'Product benefit & adoption'!$L49/1000000)","v":0},{"$f":"_xlfn.IFS('Product benefit & adoption'!$G$4=\"ALL\",'Product benefit & adoption'!AL49*'Product benefit & adoption'!$P49/1000000,'Product benefit & adoption'!$G$4=\"2020-25\",'Product benefit & adoption'!AL49*'Product benefit & adoption'!$N49/1000000,'Product benefit & adoption'!$G$4=\"2015-20\",'Product benefit & adoption'!AL49*'Product benefit & adoption'!$L49/1000000)","v":0},{"$f":"_xlfn.IFS('Product benefit & adoption'!$G$4=\"ALL\",'Product benefit & adoption'!AM49*'Product benefit & adoption'!$P49/1000000,'Product benefit & adoption'!$G$4=\"2020-25\",'Product benefit & adoption'!AM49*'Product benefit & adoption'!$N49/1000000,'Product benefit & adoption'!$G$4=\"2015-20\",'Product benefit & adoption'!AM49*'Product benefit & adoption'!$L49/1000000)","v":0},{"$f":"_xlfn.IFS('Product benefit & adoption'!$G$4=\"ALL\",'Product benefit & adoption'!AN49*'Product benefit & adoption'!$P49/1000000,'Product benefit & adoption'!$G$4=\"2020-25\",'Product benefit & adoption'!AN49*'Product benefit & adoption'!$N49/1000000,'Product benefit & adoption'!$G$4=\"2015-20\",'Product benefit & adoption'!AN49*'Product benefit & adoption'!$L49/1000000)","v":0},{"$f":"_xlfn.IFS('Product benefit & adoption'!$G$4=\"ALL\",'Product benefit & adoption'!AO49*'Product benefit & adoption'!$P49/1000000,'Product benefit & adoption'!$G$4=\"2020-25\",'Product benefit & adoption'!AO49*'Product benefit & adoption'!$N49/1000000,'Product benefit & adoption'!$G$4=\"2015-20\",'Product benefit & adoption'!AO49*'Product benefit & adoption'!$L49/1000000)","v":0},{"$f":"_xlfn.IFS('Product benefit & adoption'!$G$4=\"ALL\",'Product benefit & adoption'!AP49*'Product benefit & adoption'!$P49/1000000,'Product benefit & adoption'!$G$4=\"2020-25\",'Product benefit & adoption'!AP49*'Product benefit & adoption'!$N49/1000000,'Product benefit & adoption'!$G$4=\"2015-20\",'Product benefit & adoption'!AP49*'Product benefit & adoption'!$L49/1000000)","v":0},{"$f":"_xlfn.IFS('Product benefit & adoption'!$G$4=\"ALL\",'Product benefit & adoption'!AQ49*'Product benefit & adoption'!$P49/1000000,'Product benefit & adoption'!$G$4=\"2020-25\",'Product benefit & adoption'!AQ49*'Product benefit & adoption'!$N49/1000000,'Product benefit & adoption'!$G$4=\"2015-20\",'Product benefit & adoption'!AQ49*'Product benefit & adoption'!$L49/1000000)","v":0},{"$f":"_xlfn.IFS('Product benefit & adoption'!$G$4=\"ALL\",'Product benefit & adoption'!AR49*'Product benefit & adoption'!$P49/1000000,'Product benefit & adoption'!$G$4=\"2020-25\",'Product benefit & adoption'!AR49*'Product benefit & adoption'!$N49/1000000,'Product benefit & adoption'!$G$4=\"2015-20\",'Product benefit & adoption'!AR49*'Product benefit & adoption'!$L49/1000000)","v":0},{"$f":"_xlfn.IFS('Product benefit & adoption'!$G$4=\"ALL\",'Product benefit & adoption'!AS49*'Product benefit & adoption'!$P49/1000000,'Product benefit & adoption'!$G$4=\"2020-25\",'Product benefit & adoption'!AS49*'Product benefit & adoption'!$N49/1000000,'Product benefit & adoption'!$G$4=\"2015-20\",'Product benefit & adoption'!AS49*'Product benefit & adoption'!$L49/1000000)","v":0},{"$f":"_xlfn.IFS('Product benefit & adoption'!$G$4=\"ALL\",'Product benefit & adoption'!AT49*'Product benefit & adoption'!$P49/1000000,'Product benefit & adoption'!$G$4=\"2020-25\",'Product benefit & adoption'!AT49*'Product benefit & adoption'!$N49/1000000,'Product benefit & adoption'!$G$4=\"2015-20\",'Product benefit & adoption'!AT49*'Product benefit & adoption'!$L49/1000000)","v":0},{"$f":"_xlfn.IFS('Product benefit & adoption'!$G$4=\"ALL\",'Product benefit & adoption'!AU49*'Product benefit & adoption'!$P49/1000000,'Product benefit & adoption'!$G$4=\"2020-25\",'Product benefit & adoption'!AU49*'Product benefit & adoption'!$N49/1000000,'Product benefit & adoption'!$G$4=\"2015-20\",'Product benefit & adoption'!AU49*'Product benefit & adoption'!$L49/1000000)","v":0},{"$f":"_xlfn.IFS('Product benefit & adoption'!$G$4=\"ALL\",'Product benefit & adoption'!AV49*'Product benefit & adoption'!$P49/1000000,'Product benefit & adoption'!$G$4=\"2020-25\",'Product benefit & adoption'!AV49*'Product benefit & adoption'!$N49/1000000,'Product benefit & adoption'!$G$4=\"2015-20\",'Product benefit & adoption'!AV49*'Product benefit & adoption'!$L49/1000000)","v":0},{"$f":"_xlfn.IFS('Product benefit & adoption'!$G$4=\"ALL\",'Product benefit & adoption'!AW49*'Product benefit & adoption'!$P49/1000000,'Product benefit & adoption'!$G$4=\"2020-25\",'Product benefit & adoption'!AW49*'Product benefit & adoption'!$N49/1000000,'Product benefit & adoption'!$G$4=\"2015-20\",'Product benefit & adoption'!AW49*'Product benefit & adoption'!$L49/1000000)","v":0},{"$f":"_xlfn.IFS('Product benefit & adoption'!$G$4=\"ALL\",'Product benefit & adoption'!AX49*'Product benefit & adoption'!$P49/1000000,'Product benefit & adoption'!$G$4=\"2020-25\",'Product benefit & adoption'!AX49*'Product benefit & adoption'!$N49/1000000,'Product benefit & adoption'!$G$4=\"2015-20\",'Product benefit & adoption'!AX49*'Product benefit & adoption'!$L49/1000000)","v":0},{"$f":"_xlfn.IFS('Product benefit & adoption'!$G$4=\"ALL\",'Product benefit & adoption'!AY49*'Product benefit & adoption'!$P49/1000000,'Product benefit & adoption'!$G$4=\"2020-25\",'Product benefit & adoption'!AY49*'Product benefit & adoption'!$N49/1000000,'Product benefit & adoption'!$G$4=\"2015-20\",'Product benefit & adoption'!AY49*'Product benefit & adoption'!$L49/1000000)","v":0},{"$f":"_xlfn.IFS('Product benefit & adoption'!$G$4=\"ALL\",'Product benefit & adoption'!AZ49*'Product benefit & adoption'!$P49/1000000,'Product benefit & adoption'!$G$4=\"2020-25\",'Product benefit & adoption'!AZ49*'Product benefit & adoption'!$N49/1000000,'Product benefit & adoption'!$G$4=\"2015-20\",'Product benefit & adoption'!AZ49*'Product benefit & adoption'!$L49/1000000)","v":0},{"$f":"_xlfn.IFS('Product benefit & adoption'!$G$4=\"ALL\",'Product benefit & adoption'!BA49*'Product benefit & adoption'!$P49/1000000,'Product benefit & adoption'!$G$4=\"2020-25\",'Product benefit & adoption'!BA49*'Product benefit & adoption'!$N49/1000000,'Product benefit & adoption'!$G$4=\"2015-20\",'Product benefit & adoption'!BA49*'Product benefit & adoption'!$L49/1000000)","v":0},{"$f":"_xlfn.IFS('Product benefit & adoption'!$G$4=\"ALL\",'Product benefit & adoption'!BB49*'Product benefit & adoption'!$P49/1000000,'Product benefit & adoption'!$G$4=\"2020-25\",'Product benefit & adoption'!BB49*'Product benefit & adoption'!$N49/1000000,'Product benefit & adoption'!$G$4=\"2015-20\",'Product benefit & adoption'!BB49*'Product benefit & adoption'!$L49/1000000)","v":0},{"$f":"_xlfn.IFS('Product benefit & adoption'!$G$4=\"ALL\",'Product benefit & adoption'!BC49*'Product benefit & adoption'!$P49/1000000,'Product benefit & adoption'!$G$4=\"2020-25\",'Product benefit & adoption'!BC49*'Product benefit & adoption'!$N49/1000000,'Product benefit & adoption'!$G$4=\"2015-20\",'Product benefit & adoption'!BC49*'Product benefit & adoption'!$L49/1000000)","v":0},{"$f":"_xlfn.IFS('Product benefit & adoption'!$G$4=\"ALL\",'Product benefit & adoption'!BD49*'Product benefit & adoption'!$P49/1000000,'Product benefit & adoption'!$G$4=\"2020-25\",'Product benefit & adoption'!BD49*'Product benefit & adoption'!$N49/1000000,'Product benefit & adoption'!$G$4=\"2015-20\",'Product benefit & adoption'!BD49*'Product benefit & adoption'!$L49/1000000)","v":0}]
[null,40,{"$f":"IF('Product benefit & adoption'!D50=\"\",\"\",'Product benefit & adoption'!D50)","v":""},{"$f":"IF('Product benefit & adoption'!F50=\"\",\"\",'Product benefit & adoption'!F50)","v":""},0,{"$f":"_xlfn.IFS('Product benefit & adoption'!$G$4=\"ALL\",'Product benefit & adoption'!AA50*'Product benefit & adoption'!$P50/1000000,'Product benefit & adoption'!$G$4=\"2020-25\",'Product benefit & adoption'!AA50*'Product benefit & adoption'!$N50/1000000,'Product benefit & adoption'!$G$4=\"2015-20\",'Product benefit & adoption'!AA50*'Product benefit & adoption'!$L50/1000000)","v":0},{"$f":"_xlfn.IFS('Product benefit & adoption'!$G$4=\"ALL\",'Product benefit & adoption'!AB50*'Product benefit & adoption'!$P50/1000000,'Product benefit & adoption'!$G$4=\"2020-25\",'Product benefit & adoption'!AB50*'Product benefit & adoption'!$N50/1000000,'Product benefit & adoption'!$G$4=\"2015-20\",'Product benefit & adoption'!AB50*'Product benefit & adoption'!$L50/1000000)","v":0},{"$f":"_xlfn.IFS('Product benefit & adoption'!$G$4=\"ALL\",'Product benefit & adoption'!AC50*'Product benefit & adoption'!$P50/1000000,'Product benefit & adoption'!$G$4=\"2020-25\",'Product benefit & adoption'!AC50*'Product benefit & adoption'!$N50/1000000,'Product benefit & adoption'!$G$4=\"2015-20\",'Product benefit & adoption'!AC50*'Product benefit & adoption'!$L50/1000000)","v":0},{"$f":"_xlfn.IFS('Product benefit & adoption'!$G$4=\"ALL\",'Product benefit & adoption'!AD50*'Product benefit & adoption'!$P50/1000000,'Product benefit & adoption'!$G$4=\"2020-25\",'Product benefit & adoption'!AD50*'Product benefit & adoption'!$N50/1000000,'Product benefit & adoption'!$G$4=\"2015-20\",'Product benefit & adoption'!AD50*'Product benefit & adoption'!$L50/1000000)","v":0},{"$f":"_xlfn.IFS('Product benefit & adoption'!$G$4=\"ALL\",'Product benefit & adoption'!AE50*'Product benefit & adoption'!$P50/1000000,'Product benefit & adoption'!$G$4=\"2020-25\",'Product benefit & adoption'!AE50*'Product benefit & adoption'!$N50/1000000,'Product benefit & adoption'!$G$4=\"2015-20\",'Product benefit & adoption'!AE50*'Product benefit & adoption'!$L50/1000000)","v":0},{"$f":"_xlfn.IFS('Product benefit & adoption'!$G$4=\"ALL\",'Product benefit & adoption'!AF50*'Product benefit & adoption'!$P50/1000000,'Product benefit & adoption'!$G$4=\"2020-25\",'Product benefit & adoption'!AF50*'Product benefit & adoption'!$N50/1000000,'Product benefit & adoption'!$G$4=\"2015-20\",'Product benefit & adoption'!AF50*'Product benefit & adoption'!$L50/1000000)","v":0},{"$f":"_xlfn.IFS('Product benefit & adoption'!$G$4=\"ALL\",'Product benefit & adoption'!AG50*'Product benefit & adoption'!$P50/1000000,'Product benefit & adoption'!$G$4=\"2020-25\",'Product benefit & adoption'!AG50*'Product benefit & adoption'!$N50/1000000,'Product benefit & adoption'!$G$4=\"2015-20\",'Product benefit & adoption'!AG50*'Product benefit & adoption'!$L50/1000000)","v":0},{"$f":"_xlfn.IFS('Product benefit & adoption'!$G$4=\"ALL\",'Product benefit & adoption'!AH50*'Product benefit & adoption'!$P50/1000000,'Product benefit & adoption'!$G$4=\"2020-25\",'Product benefit & adoption'!AH50*'Product benefit & adoption'!$N50/1000000,'Product benefit & adoption'!$G$4=\"2015-20\",'Product benefit & adoption'!AH50*'Product benefit & adoption'!$L50/1000000)","v":0},{"$f":"_xlfn.IFS('Product benefit & adoption'!$G$4=\"ALL\",'Product benefit & adoption'!AI50*'Product benefit & adoption'!$P50/1000000,'Product benefit & adoption'!$G$4=\"2020-25\",'Product benefit & adoption'!AI50*'Product benefit & adoption'!$N50/1000000,'Product benefit & adoption'!$G$4=\"2015-20\",'Product benefit & adoption'!AI50*'Product benefit & adoption'!$L50/1000000)","v":0},{"$f":"_xlfn.IFS('Product benefit & adoption'!$G$4=\"ALL\",'Product benefit & adoption'!AJ50*'Product benefit & adoption'!$P50/1000000,'Product benefit & adoption'!$G$4=\"2020-25\",'Product benefit & adoption'!AJ50*'Product benefit & adoption'!$N50/1000000,'Product benefit & adoption'!$G$4=\"2015-20\",'Product benefit & adoption'!AJ50*'Product benefit & adoption'!$L50/1000000)","v":0},{"$f":"_xlfn.IFS('Product benefit & adoption'!$G$4=\"ALL\",'Product benefit & adoption'!AK50*'Product benefit & adoption'!$P50/1000000,'Product benefit & adoption'!$G$4=\"2020-25\",'Product benefit & adoption'!AK50*'Product benefit & adoption'!$N50/1000000,'Product benefit & adoption'!$G$4=\"2015-20\",'Product benefit & adoption'!AK50*'Product benefit & adoption'!$L50/1000000)","v":0},{"$f":"_xlfn.IFS('Product benefit & adoption'!$G$4=\"ALL\",'Product benefit & adoption'!AL50*'Product benefit & adoption'!$P50/1000000,'Product benefit & adoption'!$G$4=\"2020-25\",'Product benefit & adoption'!AL50*'Product benefit & adoption'!$N50/1000000,'Product benefit & adoption'!$G$4=\"2015-20\",'Product benefit & adoption'!AL50*'Product benefit & adoption'!$L50/1000000)","v":0},{"$f":"_xlfn.IFS('Product benefit & adoption'!$G$4=\"ALL\",'Product benefit & adoption'!AM50*'Product benefit & adoption'!$P50/1000000,'Product benefit & adoption'!$G$4=\"2020-25\",'Product benefit & adoption'!AM50*'Product benefit & adoption'!$N50/1000000,'Product benefit & adoption'!$G$4=\"2015-20\",'Product benefit & adoption'!AM50*'Product benefit & adoption'!$L50/1000000)","v":0},{"$f":"_xlfn.IFS('Product benefit & adoption'!$G$4=\"ALL\",'Product benefit & adoption'!AN50*'Product benefit & adoption'!$P50/1000000,'Product benefit & adoption'!$G$4=\"2020-25\",'Product benefit & adoption'!AN50*'Product benefit & adoption'!$N50/1000000,'Product benefit & adoption'!$G$4=\"2015-20\",'Product benefit & adoption'!AN50*'Product benefit & adoption'!$L50/1000000)","v":0},{"$f":"_xlfn.IFS('Product benefit & adoption'!$G$4=\"ALL\",'Product benefit & adoption'!AO50*'Product benefit & adoption'!$P50/1000000,'Product benefit & adoption'!$G$4=\"2020-25\",'Product benefit & adoption'!AO50*'Product benefit & adoption'!$N50/1000000,'Product benefit & adoption'!$G$4=\"2015-20\",'Product benefit & adoption'!AO50*'Product benefit & adoption'!$L50/1000000)","v":0},{"$f":"_xlfn.IFS('Product benefit & adoption'!$G$4=\"ALL\",'Product benefit & adoption'!AP50*'Product benefit & adoption'!$P50/1000000,'Product benefit & adoption'!$G$4=\"2020-25\",'Product benefit & adoption'!AP50*'Product benefit & adoption'!$N50/1000000,'Product benefit & adoption'!$G$4=\"2015-20\",'Product benefit & adoption'!AP50*'Product benefit & adoption'!$L50/1000000)","v":0},{"$f":"_xlfn.IFS('Product benefit & adoption'!$G$4=\"ALL\",'Product benefit & adoption'!AQ50*'Product benefit & adoption'!$P50/1000000,'Product benefit & adoption'!$G$4=\"2020-25\",'Product benefit & adoption'!AQ50*'Product benefit & adoption'!$N50/1000000,'Product benefit & adoption'!$G$4=\"2015-20\",'Product benefit & adoption'!AQ50*'Product benefit & adoption'!$L50/1000000)","v":0},{"$f":"_xlfn.IFS('Product benefit & adoption'!$G$4=\"ALL\",'Product benefit & adoption'!AR50*'Product benefit & adoption'!$P50/1000000,'Product benefit & adoption'!$G$4=\"2020-25\",'Product benefit & adoption'!AR50*'Product benefit & adoption'!$N50/1000000,'Product benefit & adoption'!$G$4=\"2015-20\",'Product benefit & adoption'!AR50*'Product benefit & adoption'!$L50/1000000)","v":0},{"$f":"_xlfn.IFS('Product benefit & adoption'!$G$4=\"ALL\",'Product benefit & adoption'!AS50*'Product benefit & adoption'!$P50/1000000,'Product benefit & adoption'!$G$4=\"2020-25\",'Product benefit & adoption'!AS50*'Product benefit & adoption'!$N50/1000000,'Product benefit & adoption'!$G$4=\"2015-20\",'Product benefit & adoption'!AS50*'Product benefit & adoption'!$L50/1000000)","v":0},{"$f":"_xlfn.IFS('Product benefit & adoption'!$G$4=\"ALL\",'Product benefit & adoption'!AT50*'Product benefit & adoption'!$P50/1000000,'Product benefit & adoption'!$G$4=\"2020-25\",'Product benefit & adoption'!AT50*'Product benefit & adoption'!$N50/1000000,'Product benefit & adoption'!$G$4=\"2015-20\",'Product benefit & adoption'!AT50*'Product benefit & adoption'!$L50/1000000)","v":0},{"$f":"_xlfn.IFS('Product benefit & adoption'!$G$4=\"ALL\",'Product benefit & adoption'!AU50*'Product benefit & adoption'!$P50/1000000,'Product benefit & adoption'!$G$4=\"2020-25\",'Product benefit & adoption'!AU50*'Product benefit & adoption'!$N50/1000000,'Product benefit & adoption'!$G$4=\"2015-20\",'Product benefit & adoption'!AU50*'Product benefit & adoption'!$L50/1000000)","v":0},{"$f":"_xlfn.IFS('Product benefit & adoption'!$G$4=\"ALL\",'Product benefit & adoption'!AV50*'Product benefit & adoption'!$P50/1000000,'Product benefit & adoption'!$G$4=\"2020-25\",'Product benefit & adoption'!AV50*'Product benefit & adoption'!$N50/1000000,'Product benefit & adoption'!$G$4=\"2015-20\",'Product benefit & adoption'!AV50*'Product benefit & adoption'!$L50/1000000)","v":0},{"$f":"_xlfn.IFS('Product benefit & adoption'!$G$4=\"ALL\",'Product benefit & adoption'!AW50*'Product benefit & adoption'!$P50/1000000,'Product benefit & adoption'!$G$4=\"2020-25\",'Product benefit & adoption'!AW50*'Product benefit & adoption'!$N50/1000000,'Product benefit & adoption'!$G$4=\"2015-20\",'Product benefit & adoption'!AW50*'Product benefit & adoption'!$L50/1000000)","v":0},{"$f":"_xlfn.IFS('Product benefit & adoption'!$G$4=\"ALL\",'Product benefit & adoption'!AX50*'Product benefit & adoption'!$P50/1000000,'Product benefit & adoption'!$G$4=\"2020-25\",'Product benefit & adoption'!AX50*'Product benefit & adoption'!$N50/1000000,'Product benefit & adoption'!$G$4=\"2015-20\",'Product benefit & adoption'!AX50*'Product benefit & adoption'!$L50/1000000)","v":0},{"$f":"_xlfn.IFS('Product benefit & adoption'!$G$4=\"ALL\",'Product benefit & adoption'!AY50*'Product benefit & adoption'!$P50/1000000,'Product benefit & adoption'!$G$4=\"2020-25\",'Product benefit & adoption'!AY50*'Product benefit & adoption'!$N50/1000000,'Product benefit & adoption'!$G$4=\"2015-20\",'Product benefit & adoption'!AY50*'Product benefit & adoption'!$L50/1000000)","v":0},{"$f":"_xlfn.IFS('Product benefit & adoption'!$G$4=\"ALL\",'Product benefit & adoption'!AZ50*'Product benefit & adoption'!$P50/1000000,'Product benefit & adoption'!$G$4=\"2020-25\",'Product benefit & adoption'!AZ50*'Product benefit & adoption'!$N50/1000000,'Product benefit & adoption'!$G$4=\"2015-20\",'Product benefit & adoption'!AZ50*'Product benefit & adoption'!$L50/1000000)","v":0},{"$f":"_xlfn.IFS('Product benefit & adoption'!$G$4=\"ALL\",'Product benefit & adoption'!BA50*'Product benefit & adoption'!$P50/1000000,'Product benefit & adoption'!$G$4=\"2020-25\",'Product benefit & adoption'!BA50*'Product benefit & adoption'!$N50/1000000,'Product benefit & adoption'!$G$4=\"2015-20\",'Product benefit & adoption'!BA50*'Product benefit & adoption'!$L50/1000000)","v":0},{"$f":"_xlfn.IFS('Product benefit & adoption'!$G$4=\"ALL\",'Product benefit & adoption'!BB50*'Product benefit & adoption'!$P50/1000000,'Product benefit & adoption'!$G$4=\"2020-25\",'Product benefit & adoption'!BB50*'Product benefit & adoption'!$N50/1000000,'Product benefit & adoption'!$G$4=\"2015-20\",'Product benefit & adoption'!BB50*'Product benefit & adoption'!$L50/1000000)","v":0},{"$f":"_xlfn.IFS('Product benefit & adoption'!$G$4=\"ALL\",'Product benefit & adoption'!BC50*'Product benefit & adoption'!$P50/1000000,'Product benefit & adoption'!$G$4=\"2020-25\",'Product benefit & adoption'!BC50*'Product benefit & adoption'!$N50/1000000,'Product benefit & adoption'!$G$4=\"2015-20\",'Product benefit & adoption'!BC50*'Product benefit & adoption'!$L50/1000000)","v":0},{"$f":"_xlfn.IFS('Product benefit & adoption'!$G$4=\"ALL\",'Product benefit & adoption'!BD50*'Product benefit & adoption'!$P50/1000000,'Product benefit & adoption'!$G$4=\"2020-25\",'Product benefit & adoption'!BD50*'Product benefit & adoption'!$N50/1000000,'Product benefit & adoption'!$G$4=\"2015-20\",'Product benefit & adoption'!BD50*'Product benefit & adoption'!$L50/1000000)","v":0}]
[null,41,{"$f":"IF('Product benefit & adoption'!D51=\"\",\"\",'Product benefit & adoption'!D51)","v":""},{"$f":"IF('Product benefit & adoption'!F51=\"\",\"\",'Product benefit & adoption'!F51)","v":""},0,{"$f":"_xlfn.IFS('Product benefit & adoption'!$G$4=\"ALL\",'Product benefit & adoption'!AA51*'Product benefit & adoption'!$P51/1000000,'Product benefit & adoption'!$G$4=\"2020-25\",'Product benefit & adoption'!AA51*'Product benefit & adoption'!$N51/1000000,'Product benefit & adoption'!$G$4=\"2015-20\",'Product benefit & adoption'!AA51*'Product benefit & adoption'!$L51/1000000)","v":0},{"$f":"_xlfn.IFS('Product benefit & adoption'!$G$4=\"ALL\",'Product benefit & adoption'!AB51*'Product benefit & adoption'!$P51/1000000,'Product benefit & adoption'!$G$4=\"2020-25\",'Product benefit & adoption'!AB51*'Product benefit & adoption'!$N51/1000000,'Product benefit & adoption'!$G$4=\"2015-20\",'Product benefit & adoption'!AB51*'Product benefit & adoption'!$L51/1000000)","v":0},{"$f":"_xlfn.IFS('Product benefit & adoption'!$G$4=\"ALL\",'Product benefit & adoption'!AC51*'Product benefit & adoption'!$P51/1000000,'Product benefit & adoption'!$G$4=\"2020-25\",'Product benefit & adoption'!AC51*'Product benefit & adoption'!$N51/1000000,'Product benefit & adoption'!$G$4=\"2015-20\",'Product benefit & adoption'!AC51*'Product benefit & adoption'!$L51/1000000)","v":0},{"$f":"_xlfn.IFS('Product benefit & adoption'!$G$4=\"ALL\",'Product benefit & adoption'!AD51*'Product benefit & adoption'!$P51/1000000,'Product benefit & adoption'!$G$4=\"2020-25\",'Product benefit & adoption'!AD51*'Product benefit & adoption'!$N51/1000000,'Product benefit & adoption'!$G$4=\"2015-20\",'Product benefit & adoption'!AD51*'Product benefit & adoption'!$L51/1000000)","v":0},{"$f":"_xlfn.IFS('Product benefit & adoption'!$G$4=\"ALL\",'Product benefit & adoption'!AE51*'Product benefit & adoption'!$P51/1000000,'Product benefit & adoption'!$G$4=\"2020-25\",'Product benefit & adoption'!AE51*'Product benefit & adoption'!$N51/1000000,'Product benefit & adoption'!$G$4=\"2015-20\",'Product benefit & adoption'!AE51*'Product benefit & adoption'!$L51/1000000)","v":0},{"$f":"_xlfn.IFS('Product benefit & adoption'!$G$4=\"ALL\",'Product benefit & adoption'!AF51*'Product benefit & adoption'!$P51/1000000,'Product benefit & adoption'!$G$4=\"2020-25\",'Product benefit & adoption'!AF51*'Product benefit & adoption'!$N51/1000000,'Product benefit & adoption'!$G$4=\"2015-20\",'Product benefit & adoption'!AF51*'Product benefit & adoption'!$L51/1000000)","v":0},{"$f":"_xlfn.IFS('Product benefit & adoption'!$G$4=\"ALL\",'Product benefit & adoption'!AG51*'Product benefit & adoption'!$P51/1000000,'Product benefit & adoption'!$G$4=\"2020-25\",'Product benefit & adoption'!AG51*'Product benefit & adoption'!$N51/1000000,'Product benefit & adoption'!$G$4=\"2015-20\",'Product benefit & adoption'!AG51*'Product benefit & adoption'!$L51/1000000)","v":0},{"$f":"_xlfn.IFS('Product benefit & adoption'!$G$4=\"ALL\",'Product benefit & adoption'!AH51*'Product benefit & adoption'!$P51/1000000,'Product benefit & adoption'!$G$4=\"2020-25\",'Product benefit & adoption'!AH51*'Product benefit & adoption'!$N51/1000000,'Product benefit & adoption'!$G$4=\"2015-20\",'Product benefit & adoption'!AH51*'Product benefit & adoption'!$L51/1000000)","v":0},{"$f":"_xlfn.IFS('Product benefit & adoption'!$G$4=\"ALL\",'Product benefit & adoption'!AI51*'Product benefit & adoption'!$P51/1000000,'Product benefit & adoption'!$G$4=\"2020-25\",'Product benefit & adoption'!AI51*'Product benefit & adoption'!$N51/1000000,'Product benefit & adoption'!$G$4=\"2015-20\",'Product benefit & adoption'!AI51*'Product benefit & adoption'!$L51/1000000)","v":0},{"$f":"_xlfn.IFS('Product benefit & adoption'!$G$4=\"ALL\",'Product benefit & adoption'!AJ51*'Product benefit & adoption'!$P51/1000000,'Product benefit & adoption'!$G$4=\"2020-25\",'Product benefit & adoption'!AJ51*'Product benefit & adoption'!$N51/1000000,'Product benefit & adoption'!$G$4=\"2015-20\",'Product benefit & adoption'!AJ51*'Product benefit & adoption'!$L51/1000000)","v":0},{"$f":"_xlfn.IFS('Product benefit & adoption'!$G$4=\"ALL\",'Product benefit & adoption'!AK51*'Product benefit & adoption'!$P51/1000000,'Product benefit & adoption'!$G$4=\"2020-25\",'Product benefit & adoption'!AK51*'Product benefit & adoption'!$N51/1000000,'Product benefit & adoption'!$G$4=\"2015-20\",'Product benefit & adoption'!AK51*'Product benefit & adoption'!$L51/1000000)","v":0},{"$f":"_xlfn.IFS('Product benefit & adoption'!$G$4=\"ALL\",'Product benefit & adoption'!AL51*'Product benefit & adoption'!$P51/1000000,'Product benefit & adoption'!$G$4=\"2020-25\",'Product benefit & adoption'!AL51*'Product benefit & adoption'!$N51/1000000,'Product benefit & adoption'!$G$4=\"2015-20\",'Product benefit & adoption'!AL51*'Product benefit & adoption'!$L51/1000000)","v":0},{"$f":"_xlfn.IFS('Product benefit & adoption'!$G$4=\"ALL\",'Product benefit & adoption'!AM51*'Product benefit & adoption'!$P51/1000000,'Product benefit & adoption'!$G$4=\"2020-25\",'Product benefit & adoption'!AM51*'Product benefit & adoption'!$N51/1000000,'Product benefit & adoption'!$G$4=\"2015-20\",'Product benefit & adoption'!AM51*'Product benefit & adoption'!$L51/1000000)","v":0},{"$f":"_xlfn.IFS('Product benefit & adoption'!$G$4=\"ALL\",'Product benefit & adoption'!AN51*'Product benefit & adoption'!$P51/1000000,'Product benefit & adoption'!$G$4=\"2020-25\",'Product benefit & adoption'!AN51*'Product benefit & adoption'!$N51/1000000,'Product benefit & adoption'!$G$4=\"2015-20\",'Product benefit & adoption'!AN51*'Product benefit & adoption'!$L51/1000000)","v":0},{"$f":"_xlfn.IFS('Product benefit & adoption'!$G$4=\"ALL\",'Product benefit & adoption'!AO51*'Product benefit & adoption'!$P51/1000000,'Product benefit & adoption'!$G$4=\"2020-25\",'Product benefit & adoption'!AO51*'Product benefit & adoption'!$N51/1000000,'Product benefit & adoption'!$G$4=\"2015-20\",'Product benefit & adoption'!AO51*'Product benefit & adoption'!$L51/1000000)","v":0},{"$f":"_xlfn.IFS('Product benefit & adoption'!$G$4=\"ALL\",'Product benefit & adoption'!AP51*'Product benefit & adoption'!$P51/1000000,'Product benefit & adoption'!$G$4=\"2020-25\",'Product benefit & adoption'!AP51*'Product benefit & adoption'!$N51/1000000,'Product benefit & adoption'!$G$4=\"2015-20\",'Product benefit & adoption'!AP51*'Product benefit & adoption'!$L51/1000000)","v":0},{"$f":"_xlfn.IFS('Product benefit & adoption'!$G$4=\"ALL\",'Product benefit & adoption'!AQ51*'Product benefit & adoption'!$P51/1000000,'Product benefit & adoption'!$G$4=\"2020-25\",'Product benefit & adoption'!AQ51*'Product benefit & adoption'!$N51/1000000,'Product benefit & adoption'!$G$4=\"2015-20\",'Product benefit & adoption'!AQ51*'Product benefit & adoption'!$L51/1000000)","v":0},{"$f":"_xlfn.IFS('Product benefit & adoption'!$G$4=\"ALL\",'Product benefit & adoption'!AR51*'Product benefit & adoption'!$P51/1000000,'Product benefit & adoption'!$G$4=\"2020-25\",'Product benefit & adoption'!AR51*'Product benefit & adoption'!$N51/1000000,'Product benefit & adoption'!$G$4=\"2015-20\",'Product benefit & adoption'!AR51*'Product benefit & adoption'!$L51/1000000)","v":0},{"$f":"_xlfn.IFS('Product benefit & adoption'!$G$4=\"ALL\",'Product benefit & adoption'!AS51*'Product benefit & adoption'!$P51/1000000,'Product benefit & adoption'!$G$4=\"2020-25\",'Product benefit & adoption'!AS51*'Product benefit & adoption'!$N51/1000000,'Product benefit & adoption'!$G$4=\"2015-20\",'Product benefit & adoption'!AS51*'Product benefit & adoption'!$L51/1000000)","v":0},{"$f":"_xlfn.IFS('Product benefit & adoption'!$G$4=\"ALL\",'Product benefit & adoption'!AT51*'Product benefit & adoption'!$P51/1000000,'Product benefit & adoption'!$G$4=\"2020-25\",'Product benefit & adoption'!AT51*'Product benefit & adoption'!$N51/1000000,'Product benefit & adoption'!$G$4=\"2015-20\",'Product benefit & adoption'!AT51*'Product benefit & adoption'!$L51/1000000)","v":0},{"$f":"_xlfn.IFS('Product benefit & adoption'!$G$4=\"ALL\",'Product benefit & adoption'!AU51*'Product benefit & adoption'!$P51/1000000,'Product benefit & adoption'!$G$4=\"2020-25\",'Product benefit & adoption'!AU51*'Product benefit & adoption'!$N51/1000000,'Product benefit & adoption'!$G$4=\"2015-20\",'Product benefit & adoption'!AU51*'Product benefit & adoption'!$L51/1000000)","v":0},{"$f":"_xlfn.IFS('Product benefit & adoption'!$G$4=\"ALL\",'Product benefit & adoption'!AV51*'Product benefit & adoption'!$P51/1000000,'Product benefit & adoption'!$G$4=\"2020-25\",'Product benefit & adoption'!AV51*'Product benefit & adoption'!$N51/1000000,'Product benefit & adoption'!$G$4=\"2015-20\",'Product benefit & adoption'!AV51*'Product benefit & adoption'!$L51/1000000)","v":0},{"$f":"_xlfn.IFS('Product benefit & adoption'!$G$4=\"ALL\",'Product benefit & adoption'!AW51*'Product benefit & adoption'!$P51/1000000,'Product benefit & adoption'!$G$4=\"2020-25\",'Product benefit & adoption'!AW51*'Product benefit & adoption'!$N51/1000000,'Product benefit & adoption'!$G$4=\"2015-20\",'Product benefit & adoption'!AW51*'Product benefit & adoption'!$L51/1000000)","v":0},{"$f":"_xlfn.IFS('Product benefit & adoption'!$G$4=\"ALL\",'Product benefit & adoption'!AX51*'Product benefit & adoption'!$P51/1000000,'Product benefit & adoption'!$G$4=\"2020-25\",'Product benefit & adoption'!AX51*'Product benefit & adoption'!$N51/1000000,'Product benefit & adoption'!$G$4=\"2015-20\",'Product benefit & adoption'!AX51*'Product benefit & adoption'!$L51/1000000)","v":0},{"$f":"_xlfn.IFS('Product benefit & adoption'!$G$4=\"ALL\",'Product benefit & adoption'!AY51*'Product benefit & adoption'!$P51/1000000,'Product benefit & adoption'!$G$4=\"2020-25\",'Product benefit & adoption'!AY51*'Product benefit & adoption'!$N51/1000000,'Product benefit & adoption'!$G$4=\"2015-20\",'Product benefit & adoption'!AY51*'Product benefit & adoption'!$L51/1000000)","v":0},{"$f":"_xlfn.IFS('Product benefit & adoption'!$G$4=\"ALL\",'Product benefit & adoption'!AZ51*'Product benefit & adoption'!$P51/1000000,'Product benefit & adoption'!$G$4=\"2020-25\",'Product benefit & adoption'!AZ51*'Product benefit & adoption'!$N51/1000000,'Product benefit & adoption'!$G$4=\"2015-20\",'Product benefit & adoption'!AZ51*'Product benefit & adoption'!$L51/1000000)","v":0},{"$f":"_xlfn.IFS('Product benefit & adoption'!$G$4=\"ALL\",'Product benefit & adoption'!BA51*'Product benefit & adoption'!$P51/1000000,'Product benefit & adoption'!$G$4=\"2020-25\",'Product benefit & adoption'!BA51*'Product benefit & adoption'!$N51/1000000,'Product benefit & adoption'!$G$4=\"2015-20\",'Product benefit & adoption'!BA51*'Product benefit & adoption'!$L51/1000000)","v":0},{"$f":"_xlfn.IFS('Product benefit & adoption'!$G$4=\"ALL\",'Product benefit & adoption'!BB51*'Product benefit & adoption'!$P51/1000000,'Product benefit & adoption'!$G$4=\"2020-25\",'Product benefit & adoption'!BB51*'Product benefit & adoption'!$N51/1000000,'Product benefit & adoption'!$G$4=\"2015-20\",'Product benefit & adoption'!BB51*'Product benefit & adoption'!$L51/1000000)","v":0},{"$f":"_xlfn.IFS('Product benefit & adoption'!$G$4=\"ALL\",'Product benefit & adoption'!BC51*'Product benefit & adoption'!$P51/1000000,'Product benefit & adoption'!$G$4=\"2020-25\",'Product benefit & adoption'!BC51*'Product benefit & adoption'!$N51/1000000,'Product benefit & adoption'!$G$4=\"2015-20\",'Product benefit & adoption'!BC51*'Product benefit & adoption'!$L51/1000000)","v":0},{"$f":"_xlfn.IFS('Product benefit & adoption'!$G$4=\"ALL\",'Product benefit & adoption'!BD51*'Product benefit & adoption'!$P51/1000000,'Product benefit & adoption'!$G$4=\"2020-25\",'Product benefit & adoption'!BD51*'Product benefit & adoption'!$N51/1000000,'Product benefit & adoption'!$G$4=\"2015-20\",'Product benefit & adoption'!BD51*'Product benefit & adoption'!$L51/1000000)","v":0}]
[null,42,{"$f":"IF('Product benefit & adoption'!D52=\"\",\"\",'Product benefit & adoption'!D52)","v":""},{"$f":"IF('Product benefit & adoption'!F52=\"\",\"\",'Product benefit & adoption'!F52)","v":""},0,{"$f":"_xlfn.IFS('Product benefit & adoption'!$G$4=\"ALL\",'Product benefit & adoption'!AA52*'Product benefit & adoption'!$P52/1000000,'Product benefit & adoption'!$G$4=\"2020-25\",'Product benefit & adoption'!AA52*'Product benefit & adoption'!$N52/1000000,'Product benefit & adoption'!$G$4=\"2015-20\",'Product benefit & adoption'!AA52*'Product benefit & adoption'!$L52/1000000)","v":0},{"$f":"_xlfn.IFS('Product benefit & adoption'!$G$4=\"ALL\",'Product benefit & adoption'!AB52*'Product benefit & adoption'!$P52/1000000,'Product benefit & adoption'!$G$4=\"2020-25\",'Product benefit & adoption'!AB52*'Product benefit & adoption'!$N52/1000000,'Product benefit & adoption'!$G$4=\"2015-20\",'Product benefit & adoption'!AB52*'Product benefit & adoption'!$L52/1000000)","v":0},{"$f":"_xlfn.IFS('Product benefit & adoption'!$G$4=\"ALL\",'Product benefit & adoption'!AC52*'Product benefit & adoption'!$P52/1000000,'Product benefit & adoption'!$G$4=\"2020-25\",'Product benefit & adoption'!AC52*'Product benefit & adoption'!$N52/1000000,'Product benefit & adoption'!$G$4=\"2015-20\",'Product benefit & adoption'!AC52*'Product benefit & adoption'!$L52/1000000)","v":0},{"$f":"_xlfn.IFS('Product benefit & adoption'!$G$4=\"ALL\",'Product benefit & adoption'!AD52*'Product benefit & adoption'!$P52/1000000,'Product benefit & adoption'!$G$4=\"2020-25\",'Product benefit & adoption'!AD52*'Product benefit & adoption'!$N52/1000000,'Product benefit & adoption'!$G$4=\"2015-20\",'Product benefit & adoption'!AD52*'Product benefit & adoption'!$L52/1000000)","v":0},{"$f":"_xlfn.IFS('Product benefit & adoption'!$G$4=\"ALL\",'Product benefit & adoption'!AE52*'Product benefit & adoption'!$P52/1000000,'Product benefit & adoption'!$G$4=\"2020-25\",'Product benefit & adoption'!AE52*'Product benefit & adoption'!$N52/1000000,'Product benefit & adoption'!$G$4=\"2015-20\",'Product benefit & adoption'!AE52*'Product benefit & adoption'!$L52/1000000)","v":0},{"$f":"_xlfn.IFS('Product benefit & adoption'!$G$4=\"ALL\",'Product benefit & adoption'!AF52*'Product benefit & adoption'!$P52/1000000,'Product benefit & adoption'!$G$4=\"2020-25\",'Product benefit & adoption'!AF52*'Product benefit & adoption'!$N52/1000000,'Product benefit & adoption'!$G$4=\"2015-20\",'Product benefit & adoption'!AF52*'Product benefit & adoption'!$L52/1000000)","v":0},{"$f":"_xlfn.IFS('Product benefit & adoption'!$G$4=\"ALL\",'Product benefit & adoption'!AG52*'Product benefit & adoption'!$P52/1000000,'Product benefit & adoption'!$G$4=\"2020-25\",'Product benefit & adoption'!AG52*'Product benefit & adoption'!$N52/1000000,'Product benefit & adoption'!$G$4=\"2015-20\",'Product benefit & adoption'!AG52*'Product benefit & adoption'!$L52/1000000)","v":0},{"$f":"_xlfn.IFS('Product benefit & adoption'!$G$4=\"ALL\",'Product benefit & adoption'!AH52*'Product benefit & adoption'!$P52/1000000,'Product benefit & adoption'!$G$4=\"2020-25\",'Product benefit & adoption'!AH52*'Product benefit & adoption'!$N52/1000000,'Product benefit & adoption'!$G$4=\"2015-20\",'Product benefit & adoption'!AH52*'Product benefit & adoption'!$L52/1000000)","v":0},{"$f":"_xlfn.IFS('Product benefit & adoption'!$G$4=\"ALL\",'Product benefit & adoption'!AI52*'Product benefit & adoption'!$P52/1000000,'Product benefit & adoption'!$G$4=\"2020-25\",'Product benefit & adoption'!AI52*'Product benefit & adoption'!$N52/1000000,'Product benefit & adoption'!$G$4=\"2015-20\",'Product benefit & adoption'!AI52*'Product benefit & adoption'!$L52/1000000)","v":0},{"$f":"_xlfn.IFS('Product benefit & adoption'!$G$4=\"ALL\",'Product benefit & adoption'!AJ52*'Product benefit & adoption'!$P52/1000000,'Product benefit & adoption'!$G$4=\"2020-25\",'Product benefit & adoption'!AJ52*'Product benefit & adoption'!$N52/1000000,'Product benefit & adoption'!$G$4=\"2015-20\",'Product benefit & adoption'!AJ52*'Product benefit & adoption'!$L52/1000000)","v":0},{"$f":"_xlfn.IFS('Product benefit & adoption'!$G$4=\"ALL\",'Product benefit & adoption'!AK52*'Product benefit & adoption'!$P52/1000000,'Product benefit & adoption'!$G$4=\"2020-25\",'Product benefit & adoption'!AK52*'Product benefit & adoption'!$N52/1000000,'Product benefit & adoption'!$G$4=\"2015-20\",'Product benefit & adoption'!AK52*'Product benefit & adoption'!$L52/1000000)","v":0},{"$f":"_xlfn.IFS('Product benefit & adoption'!$G$4=\"ALL\",'Product benefit & adoption'!AL52*'Product benefit & adoption'!$P52/1000000,'Product benefit & adoption'!$G$4=\"2020-25\",'Product benefit & adoption'!AL52*'Product benefit & adoption'!$N52/1000000,'Product benefit & adoption'!$G$4=\"2015-20\",'Product benefit & adoption'!AL52*'Product benefit & adoption'!$L52/1000000)","v":0},{"$f":"_xlfn.IFS('Product benefit & adoption'!$G$4=\"ALL\",'Product benefit & adoption'!AM52*'Product benefit & adoption'!$P52/1000000,'Product benefit & adoption'!$G$4=\"2020-25\",'Product benefit & adoption'!AM52*'Product benefit & adoption'!$N52/1000000,'Product benefit & adoption'!$G$4=\"2015-20\",'Product benefit & adoption'!AM52*'Product benefit & adoption'!$L52/1000000)","v":0},{"$f":"_xlfn.IFS('Product benefit & adoption'!$G$4=\"ALL\",'Product benefit & adoption'!AN52*'Product benefit & adoption'!$P52/1000000,'Product benefit & adoption'!$G$4=\"2020-25\",'Product benefit & adoption'!AN52*'Product benefit & adoption'!$N52/1000000,'Product benefit & adoption'!$G$4=\"2015-20\",'Product benefit & adoption'!AN52*'Product benefit & adoption'!$L52/1000000)","v":0},{"$f":"_xlfn.IFS('Product benefit & adoption'!$G$4=\"ALL\",'Product benefit & adoption'!AO52*'Product benefit & adoption'!$P52/1000000,'Product benefit & adoption'!$G$4=\"2020-25\",'Product benefit & adoption'!AO52*'Product benefit & adoption'!$N52/1000000,'Product benefit & adoption'!$G$4=\"2015-20\",'Product benefit & adoption'!AO52*'Product benefit & adoption'!$L52/1000000)","v":0},{"$f":"_xlfn.IFS('Product benefit & adoption'!$G$4=\"ALL\",'Product benefit & adoption'!AP52*'Product benefit & adoption'!$P52/1000000,'Product benefit & adoption'!$G$4=\"2020-25\",'Product benefit & adoption'!AP52*'Product benefit & adoption'!$N52/1000000,'Product benefit & adoption'!$G$4=\"2015-20\",'Product benefit & adoption'!AP52*'Product benefit & adoption'!$L52/1000000)","v":0},{"$f":"_xlfn.IFS('Product benefit & adoption'!$G$4=\"ALL\",'Product benefit & adoption'!AQ52*'Product benefit & adoption'!$P52/1000000,'Product benefit & adoption'!$G$4=\"2020-25\",'Product benefit & adoption'!AQ52*'Product benefit & adoption'!$N52/1000000,'Product benefit & adoption'!$G$4=\"2015-20\",'Product benefit & adoption'!AQ52*'Product benefit & adoption'!$L52/1000000)","v":0},{"$f":"_xlfn.IFS('Product benefit & adoption'!$G$4=\"ALL\",'Product benefit & adoption'!AR52*'Product benefit & adoption'!$P52/1000000,'Product benefit & adoption'!$G$4=\"2020-25\",'Product benefit & adoption'!AR52*'Product benefit & adoption'!$N52/1000000,'Product benefit & adoption'!$G$4=\"2015-20\",'Product benefit & adoption'!AR52*'Product benefit & adoption'!$L52/1000000)","v":0},{"$f":"_xlfn.IFS('Product benefit & adoption'!$G$4=\"ALL\",'Product benefit & adoption'!AS52*'Product benefit & adoption'!$P52/1000000,'Product benefit & adoption'!$G$4=\"2020-25\",'Product benefit & adoption'!AS52*'Product benefit & adoption'!$N52/1000000,'Product benefit & adoption'!$G$4=\"2015-20\",'Product benefit & adoption'!AS52*'Product benefit & adoption'!$L52/1000000)","v":0},{"$f":"_xlfn.IFS('Product benefit & adoption'!$G$4=\"ALL\",'Product benefit & adoption'!AT52*'Product benefit & adoption'!$P52/1000000,'Product benefit & adoption'!$G$4=\"2020-25\",'Product benefit & adoption'!AT52*'Product benefit & adoption'!$N52/1000000,'Product benefit & adoption'!$G$4=\"2015-20\",'Product benefit & adoption'!AT52*'Product benefit & adoption'!$L52/1000000)","v":0},{"$f":"_xlfn.IFS('Product benefit & adoption'!$G$4=\"ALL\",'Product benefit & adoption'!AU52*'Product benefit & adoption'!$P52/1000000,'Product benefit & adoption'!$G$4=\"2020-25\",'Product benefit & adoption'!AU52*'Product benefit & adoption'!$N52/1000000,'Product benefit & adoption'!$G$4=\"2015-20\",'Product benefit & adoption'!AU52*'Product benefit & adoption'!$L52/1000000)","v":0},{"$f":"_xlfn.IFS('Product benefit & adoption'!$G$4=\"ALL\",'Product benefit & adoption'!AV52*'Product benefit & adoption'!$P52/1000000,'Product benefit & adoption'!$G$4=\"2020-25\",'Product benefit & adoption'!AV52*'Product benefit & adoption'!$N52/1000000,'Product benefit & adoption'!$G$4=\"2015-20\",'Product benefit & adoption'!AV52*'Product benefit & adoption'!$L52/1000000)","v":0},{"$f":"_xlfn.IFS('Product benefit & adoption'!$G$4=\"ALL\",'Product benefit & adoption'!AW52*'Product benefit & adoption'!$P52/1000000,'Product benefit & adoption'!$G$4=\"2020-25\",'Product benefit & adoption'!AW52*'Product benefit & adoption'!$N52/1000000,'Product benefit & adoption'!$G$4=\"2015-20\",'Product benefit & adoption'!AW52*'Product benefit & adoption'!$L52/1000000)","v":0},{"$f":"_xlfn.IFS('Product benefit & adoption'!$G$4=\"ALL\",'Product benefit & adoption'!AX52*'Product benefit & adoption'!$P52/1000000,'Product benefit & adoption'!$G$4=\"2020-25\",'Product benefit & adoption'!AX52*'Product benefit & adoption'!$N52/1000000,'Product benefit & adoption'!$G$4=\"2015-20\",'Product benefit & adoption'!AX52*'Product benefit & adoption'!$L52/1000000)","v":0},{"$f":"_xlfn.IFS('Product benefit & adoption'!$G$4=\"ALL\",'Product benefit & adoption'!AY52*'Product benefit & adoption'!$P52/1000000,'Product benefit & adoption'!$G$4=\"2020-25\",'Product benefit & adoption'!AY52*'Product benefit & adoption'!$N52/1000000,'Product benefit & adoption'!$G$4=\"2015-20\",'Product benefit & adoption'!AY52*'Product benefit & adoption'!$L52/1000000)","v":0},{"$f":"_xlfn.IFS('Product benefit & adoption'!$G$4=\"ALL\",'Product benefit & adoption'!AZ52*'Product benefit & adoption'!$P52/1000000,'Product benefit & adoption'!$G$4=\"2020-25\",'Product benefit & adoption'!AZ52*'Product benefit & adoption'!$N52/1000000,'Product benefit & adoption'!$G$4=\"2015-20\",'Product benefit & adoption'!AZ52*'Product benefit & adoption'!$L52/1000000)","v":0},{"$f":"_xlfn.IFS('Product benefit & adoption'!$G$4=\"ALL\",'Product benefit & adoption'!BA52*'Product benefit & adoption'!$P52/1000000,'Product benefit & adoption'!$G$4=\"2020-25\",'Product benefit & adoption'!BA52*'Product benefit & adoption'!$N52/1000000,'Product benefit & adoption'!$G$4=\"2015-20\",'Product benefit & adoption'!BA52*'Product benefit & adoption'!$L52/1000000)","v":0},{"$f":"_xlfn.IFS('Product benefit & adoption'!$G$4=\"ALL\",'Product benefit & adoption'!BB52*'Product benefit & adoption'!$P52/1000000,'Product benefit & adoption'!$G$4=\"2020-25\",'Product benefit & adoption'!BB52*'Product benefit & adoption'!$N52/1000000,'Product benefit & adoption'!$G$4=\"2015-20\",'Product benefit & adoption'!BB52*'Product benefit & adoption'!$L52/1000000)","v":0},{"$f":"_xlfn.IFS('Product benefit & adoption'!$G$4=\"ALL\",'Product benefit & adoption'!BC52*'Product benefit & adoption'!$P52/1000000,'Product benefit & adoption'!$G$4=\"2020-25\",'Product benefit & adoption'!BC52*'Product benefit & adoption'!$N52/1000000,'Product benefit & adoption'!$G$4=\"2015-20\",'Product benefit & adoption'!BC52*'Product benefit & adoption'!$L52/1000000)","v":0},{"$f":"_xlfn.IFS('Product benefit & adoption'!$G$4=\"ALL\",'Product benefit & adoption'!BD52*'Product benefit & adoption'!$P52/1000000,'Product benefit & adoption'!$G$4=\"2020-25\",'Product benefit & adoption'!BD52*'Product benefit & adoption'!$N52/1000000,'Product benefit & adoption'!$G$4=\"2015-20\",'Product benefit & adoption'!BD52*'Product benefit & adoption'!$L52/1000000)","v":0}]
[null,43,{"$f":"IF('Product benefit & adoption'!D53=\"\",\"\",'Product benefit & adoption'!D53)","v":""},{"$f":"IF('Product benefit & adoption'!F53=\"\",\"\",'Product benefit & adoption'!F53)","v":""},0,{"$f":"_xlfn.IFS('Product benefit & adoption'!$G$4=\"ALL\",'Product benefit & adoption'!AA53*'Product benefit & adoption'!$P53/1000000,'Product benefit & adoption'!$G$4=\"2020-25\",'Product benefit & adoption'!AA53*'Product benefit & adoption'!$N53/1000000,'Product benefit & adoption'!$G$4=\"2015-20\",'Product benefit & adoption'!AA53*'Product benefit & adoption'!$L53/1000000)","v":0},{"$f":"_xlfn.IFS('Product benefit & adoption'!$G$4=\"ALL\",'Product benefit & adoption'!AB53*'Product benefit & adoption'!$P53/1000000,'Product benefit & adoption'!$G$4=\"2020-25\",'Product benefit & adoption'!AB53*'Product benefit & adoption'!$N53/1000000,'Product benefit & adoption'!$G$4=\"2015-20\",'Product benefit & adoption'!AB53*'Product benefit & adoption'!$L53/1000000)","v":0},{"$f":"_xlfn.IFS('Product benefit & adoption'!$G$4=\"ALL\",'Product benefit & adoption'!AC53*'Product benefit & adoption'!$P53/1000000,'Product benefit & adoption'!$G$4=\"2020-25\",'Product benefit & adoption'!AC53*'Product benefit & adoption'!$N53/1000000,'Product benefit & adoption'!$G$4=\"2015-20\",'Product benefit & adoption'!AC53*'Product benefit & adoption'!$L53/1000000)","v":0},{"$f":"_xlfn.IFS('Product benefit & adoption'!$G$4=\"ALL\",'Product benefit & adoption'!AD53*'Product benefit & adoption'!$P53/1000000,'Product benefit & adoption'!$G$4=\"2020-25\",'Product benefit & adoption'!AD53*'Product benefit & adoption'!$N53/1000000,'Product benefit & adoption'!$G$4=\"2015-20\",'Product benefit & adoption'!AD53*'Product benefit & adoption'!$L53/1000000)","v":0},{"$f":"_xlfn.IFS('Product benefit & adoption'!$G$4=\"ALL\",'Product benefit & adoption'!AE53*'Product benefit & adoption'!$P53/1000000,'Product benefit & adoption'!$G$4=\"2020-25\",'Product benefit & adoption'!AE53*'Product benefit & adoption'!$N53/1000000,'Product benefit & adoption'!$G$4=\"2015-20\",'Product benefit & adoption'!AE53*'Product benefit & adoption'!$L53/1000000)","v":0},{"$f":"_xlfn.IFS('Product benefit & adoption'!$G$4=\"ALL\",'Product benefit & adoption'!AF53*'Product benefit & adoption'!$P53/1000000,'Product benefit & adoption'!$G$4=\"2020-25\",'Product benefit & adoption'!AF53*'Product benefit & adoption'!$N53/1000000,'Product benefit & adoption'!$G$4=\"2015-20\",'Product benefit & adoption'!AF53*'Product benefit & adoption'!$L53/1000000)","v":0},{"$f":"_xlfn.IFS('Product benefit & adoption'!$G$4=\"ALL\",'Product benefit & adoption'!AG53*'Product benefit & adoption'!$P53/1000000,'Product benefit & adoption'!$G$4=\"2020-25\",'Product benefit & adoption'!AG53*'Product benefit & adoption'!$N53/1000000,'Product benefit & adoption'!$G$4=\"2015-20\",'Product benefit & adoption'!AG53*'Product benefit & adoption'!$L53/1000000)","v":0},{"$f":"_xlfn.IFS('Product benefit & adoption'!$G$4=\"ALL\",'Product benefit & adoption'!AH53*'Product benefit & adoption'!$P53/1000000,'Product benefit & adoption'!$G$4=\"2020-25\",'Product benefit & adoption'!AH53*'Product benefit & adoption'!$N53/1000000,'Product benefit & adoption'!$G$4=\"2015-20\",'Product benefit & adoption'!AH53*'Product benefit & adoption'!$L53/1000000)","v":0},{"$f":"_xlfn.IFS('Product benefit & adoption'!$G$4=\"ALL\",'Product benefit & adoption'!AI53*'Product benefit & adoption'!$P53/1000000,'Product benefit & adoption'!$G$4=\"2020-25\",'Product benefit & adoption'!AI53*'Product benefit & adoption'!$N53/1000000,'Product benefit & adoption'!$G$4=\"2015-20\",'Product benefit & adoption'!AI53*'Product benefit & adoption'!$L53/1000000)","v":0},{"$f":"_xlfn.IFS('Product benefit & adoption'!$G$4=\"ALL\",'Product benefit & adoption'!AJ53*'Product benefit & adoption'!$P53/1000000,'Product benefit & adoption'!$G$4=\"2020-25\",'Product benefit & adoption'!AJ53*'Product benefit & adoption'!$N53/1000000,'Product benefit & adoption'!$G$4=\"2015-20\",'Product benefit & adoption'!AJ53*'Product benefit & adoption'!$L53/1000000)","v":0},{"$f":"_xlfn.IFS('Product benefit & adoption'!$G$4=\"ALL\",'Product benefit & adoption'!AK53*'Product benefit & adoption'!$P53/1000000,'Product benefit & adoption'!$G$4=\"2020-25\",'Product benefit & adoption'!AK53*'Product benefit & adoption'!$N53/1000000,'Product benefit & adoption'!$G$4=\"2015-20\",'Product benefit & adoption'!AK53*'Product benefit & adoption'!$L53/1000000)","v":0},{"$f":"_xlfn.IFS('Product benefit & adoption'!$G$4=\"ALL\",'Product benefit & adoption'!AL53*'Product benefit & adoption'!$P53/1000000,'Product benefit & adoption'!$G$4=\"2020-25\",'Product benefit & adoption'!AL53*'Product benefit & adoption'!$N53/1000000,'Product benefit & adoption'!$G$4=\"2015-20\",'Product benefit & adoption'!AL53*'Product benefit & adoption'!$L53/1000000)","v":0},{"$f":"_xlfn.IFS('Product benefit & adoption'!$G$4=\"ALL\",'Product benefit & adoption'!AM53*'Product benefit & adoption'!$P53/1000000,'Product benefit & adoption'!$G$4=\"2020-25\",'Product benefit & adoption'!AM53*'Product benefit & adoption'!$N53/1000000,'Product benefit & adoption'!$G$4=\"2015-20\",'Product benefit & adoption'!AM53*'Product benefit & adoption'!$L53/1000000)","v":0},{"$f":"_xlfn.IFS('Product benefit & adoption'!$G$4=\"ALL\",'Product benefit & adoption'!AN53*'Product benefit & adoption'!$P53/1000000,'Product benefit & adoption'!$G$4=\"2020-25\",'Product benefit & adoption'!AN53*'Product benefit & adoption'!$N53/1000000,'Product benefit & adoption'!$G$4=\"2015-20\",'Product benefit & adoption'!AN53*'Product benefit & adoption'!$L53/1000000)","v":0},{"$f":"_xlfn.IFS('Product benefit & adoption'!$G$4=\"ALL\",'Product benefit & adoption'!AO53*'Product benefit & adoption'!$P53/1000000,'Product benefit & adoption'!$G$4=\"2020-25\",'Product benefit & adoption'!AO53*'Product benefit & adoption'!$N53/1000000,'Product benefit & adoption'!$G$4=\"2015-20\",'Product benefit & adoption'!AO53*'Product benefit & adoption'!$L53/1000000)","v":0},{"$f":"_xlfn.IFS('Product benefit & adoption'!$G$4=\"ALL\",'Product benefit & adoption'!AP53*'Product benefit & adoption'!$P53/1000000,'Product benefit & adoption'!$G$4=\"2020-25\",'Product benefit & adoption'!AP53*'Product benefit & adoption'!$N53/1000000,'Product benefit & adoption'!$G$4=\"2015-20\",'Product benefit & adoption'!AP53*'Product benefit & adoption'!$L53/1000000)","v":0},{"$f":"_xlfn.IFS('Product benefit & adoption'!$G$4=\"ALL\",'Product benefit & adoption'!AQ53*'Product benefit & adoption'!$P53/1000000,'Product benefit & adoption'!$G$4=\"2020-25\",'Product benefit & adoption'!AQ53*'Product benefit & adoption'!$N53/1000000,'Product benefit & adoption'!$G$4=\"2015-20\",'Product benefit & adoption'!AQ53*'Product benefit & adoption'!$L53/1000000)","v":0},{"$f":"_xlfn.IFS('Product benefit & adoption'!$G$4=\"ALL\",'Product benefit & adoption'!AR53*'Product benefit & adoption'!$P53/1000000,'Product benefit & adoption'!$G$4=\"2020-25\",'Product benefit & adoption'!AR53*'Product benefit & adoption'!$N53/1000000,'Product benefit & adoption'!$G$4=\"2015-20\",'Product benefit & adoption'!AR53*'Product benefit & adoption'!$L53/1000000)","v":0},{"$f":"_xlfn.IFS('Product benefit & adoption'!$G$4=\"ALL\",'Product benefit & adoption'!AS53*'Product benefit & adoption'!$P53/1000000,'Product benefit & adoption'!$G$4=\"2020-25\",'Product benefit & adoption'!AS53*'Product benefit & adoption'!$N53/1000000,'Product benefit & adoption'!$G$4=\"2015-20\",'Product benefit & adoption'!AS53*'Product benefit & adoption'!$L53/1000000)","v":0},{"$f":"_xlfn.IFS('Product benefit & adoption'!$G$4=\"ALL\",'Product benefit & adoption'!AT53*'Product benefit & adoption'!$P53/1000000,'Product benefit & adoption'!$G$4=\"2020-25\",'Product benefit & adoption'!AT53*'Product benefit & adoption'!$N53/1000000,'Product benefit & adoption'!$G$4=\"2015-20\",'Product benefit & adoption'!AT53*'Product benefit & adoption'!$L53/1000000)","v":0},{"$f":"_xlfn.IFS('Product benefit & adoption'!$G$4=\"ALL\",'Product benefit & adoption'!AU53*'Product benefit & adoption'!$P53/1000000,'Product benefit & adoption'!$G$4=\"2020-25\",'Product benefit & adoption'!AU53*'Product benefit & adoption'!$N53/1000000,'Product benefit & adoption'!$G$4=\"2015-20\",'Product benefit & adoption'!AU53*'Product benefit & adoption'!$L53/1000000)","v":0},{"$f":"_xlfn.IFS('Product benefit & adoption'!$G$4=\"ALL\",'Product benefit & adoption'!AV53*'Product benefit & adoption'!$P53/1000000,'Product benefit & adoption'!$G$4=\"2020-25\",'Product benefit & adoption'!AV53*'Product benefit & adoption'!$N53/1000000,'Product benefit & adoption'!$G$4=\"2015-20\",'Product benefit & adoption'!AV53*'Product benefit & adoption'!$L53/1000000)","v":0},{"$f":"_xlfn.IFS('Product benefit & adoption'!$G$4=\"ALL\",'Product benefit & adoption'!AW53*'Product benefit & adoption'!$P53/1000000,'Product benefit & adoption'!$G$4=\"2020-25\",'Product benefit & adoption'!AW53*'Product benefit & adoption'!$N53/1000000,'Product benefit & adoption'!$G$4=\"2015-20\",'Product benefit & adoption'!AW53*'Product benefit & adoption'!$L53/1000000)","v":0},{"$f":"_xlfn.IFS('Product benefit & adoption'!$G$4=\"ALL\",'Product benefit & adoption'!AX53*'Product benefit & adoption'!$P53/1000000,'Product benefit & adoption'!$G$4=\"2020-25\",'Product benefit & adoption'!AX53*'Product benefit & adoption'!$N53/1000000,'Product benefit & adoption'!$G$4=\"2015-20\",'Product benefit & adoption'!AX53*'Product benefit & adoption'!$L53/1000000)","v":0},{"$f":"_xlfn.IFS('Product benefit & adoption'!$G$4=\"ALL\",'Product benefit & adoption'!AY53*'Product benefit & adoption'!$P53/1000000,'Product benefit & adoption'!$G$4=\"2020-25\",'Product benefit & adoption'!AY53*'Product benefit & adoption'!$N53/1000000,'Product benefit & adoption'!$G$4=\"2015-20\",'Product benefit & adoption'!AY53*'Product benefit & adoption'!$L53/1000000)","v":0},{"$f":"_xlfn.IFS('Product benefit & adoption'!$G$4=\"ALL\",'Product benefit & adoption'!AZ53*'Product benefit & adoption'!$P53/1000000,'Product benefit & adoption'!$G$4=\"2020-25\",'Product benefit & adoption'!AZ53*'Product benefit & adoption'!$N53/1000000,'Product benefit & adoption'!$G$4=\"2015-20\",'Product benefit & adoption'!AZ53*'Product benefit & adoption'!$L53/1000000)","v":0},{"$f":"_xlfn.IFS('Product benefit & adoption'!$G$4=\"ALL\",'Product benefit & adoption'!BA53*'Product benefit & adoption'!$P53/1000000,'Product benefit & adoption'!$G$4=\"2020-25\",'Product benefit & adoption'!BA53*'Product benefit & adoption'!$N53/1000000,'Product benefit & adoption'!$G$4=\"2015-20\",'Product benefit & adoption'!BA53*'Product benefit & adoption'!$L53/1000000)","v":0},{"$f":"_xlfn.IFS('Product benefit & adoption'!$G$4=\"ALL\",'Product benefit & adoption'!BB53*'Product benefit & adoption'!$P53/1000000,'Product benefit & adoption'!$G$4=\"2020-25\",'Product benefit & adoption'!BB53*'Product benefit & adoption'!$N53/1000000,'Product benefit & adoption'!$G$4=\"2015-20\",'Product benefit & adoption'!BB53*'Product benefit & adoption'!$L53/1000000)","v":0},{"$f":"_xlfn.IFS('Product benefit & adoption'!$G$4=\"ALL\",'Product benefit & adoption'!BC53*'Product benefit & adoption'!$P53/1000000,'Product benefit & adoption'!$G$4=\"2020-25\",'Product benefit & adoption'!BC53*'Product benefit & adoption'!$N53/1000000,'Product benefit & adoption'!$G$4=\"2015-20\",'Product benefit & adoption'!BC53*'Product benefit & adoption'!$L53/1000000)","v":0},{"$f":"_xlfn.IFS('Product benefit & adoption'!$G$4=\"ALL\",'Product benefit & adoption'!BD53*'Product benefit & adoption'!$P53/1000000,'Product benefit & adoption'!$G$4=\"2020-25\",'Product benefit & adoption'!BD53*'Product benefit & adoption'!$N53/1000000,'Product benefit & adoption'!$G$4=\"2015-20\",'Product benefit & adoption'!BD53*'Product benefit & adoption'!$L53/1000000)","v":0}]
[null,44,{"$f":"IF('Product benefit & adoption'!D54=\"\",\"\",'Product benefit & adoption'!D54)","v":""},{"$f":"IF('Product benefit & adoption'!F54=\"\",\"\",'Product benefit & adoption'!F54)","v":""},0,{"$f":"_xlfn.IFS('Product benefit & adoption'!$G$4=\"ALL\",'Product benefit & adoption'!AA54*'Product benefit & adoption'!$P54/1000000,'Product benefit & adoption'!$G$4=\"2020-25\",'Product benefit & adoption'!AA54*'Product benefit & adoption'!$N54/1000000,'Product benefit & adoption'!$G$4=\"2015-20\",'Product benefit & adoption'!AA54*'Product benefit & adoption'!$L54/1000000)","v":0},{"$f":"_xlfn.IFS('Product benefit & adoption'!$G$4=\"ALL\",'Product benefit & adoption'!AB54*'Product benefit & adoption'!$P54/1000000,'Product benefit & adoption'!$G$4=\"2020-25\",'Product benefit & adoption'!AB54*'Product benefit & adoption'!$N54/1000000,'Product benefit & adoption'!$G$4=\"2015-20\",'Product benefit & adoption'!AB54*'Product benefit & adoption'!$L54/1000000)","v":0},{"$f":"_xlfn.IFS('Product benefit & adoption'!$G$4=\"ALL\",'Product benefit & adoption'!AC54*'Product benefit & adoption'!$P54/1000000,'Product benefit & adoption'!$G$4=\"2020-25\",'Product benefit & adoption'!AC54*'Product benefit & adoption'!$N54/1000000,'Product benefit & adoption'!$G$4=\"2015-20\",'Product benefit & adoption'!AC54*'Product benefit & adoption'!$L54/1000000)","v":0},{"$f":"_xlfn.IFS('Product benefit & adoption'!$G$4=\"ALL\",'Product benefit & adoption'!AD54*'Product benefit & adoption'!$P54/1000000,'Product benefit & adoption'!$G$4=\"2020-25\",'Product benefit & adoption'!AD54*'Product benefit & adoption'!$N54/1000000,'Product benefit & adoption'!$G$4=\"2015-20\",'Product benefit & adoption'!AD54*'Product benefit & adoption'!$L54/1000000)","v":0},{"$f":"_xlfn.IFS('Product benefit & adoption'!$G$4=\"ALL\",'Product benefit & adoption'!AE54*'Product benefit & adoption'!$P54/1000000,'Product benefit & adoption'!$G$4=\"2020-25\",'Product benefit & adoption'!AE54*'Product benefit & adoption'!$N54/1000000,'Product benefit & adoption'!$G$4=\"2015-20\",'Product benefit & adoption'!AE54*'Product benefit & adoption'!$L54/1000000)","v":0},{"$f":"_xlfn.IFS('Product benefit & adoption'!$G$4=\"ALL\",'Product benefit & adoption'!AF54*'Product benefit & adoption'!$P54/1000000,'Product benefit & adoption'!$G$4=\"2020-25\",'Product benefit & adoption'!AF54*'Product benefit & adoption'!$N54/1000000,'Product benefit & adoption'!$G$4=\"2015-20\",'Product benefit & adoption'!AF54*'Product benefit & adoption'!$L54/1000000)","v":0},{"$f":"_xlfn.IFS('Product benefit & adoption'!$G$4=\"ALL\",'Product benefit & adoption'!AG54*'Product benefit & adoption'!$P54/1000000,'Product benefit & adoption'!$G$4=\"2020-25\",'Product benefit & adoption'!AG54*'Product benefit & adoption'!$N54/1000000,'Product benefit & adoption'!$G$4=\"2015-20\",'Product benefit & adoption'!AG54*'Product benefit & adoption'!$L54/1000000)","v":0},{"$f":"_xlfn.IFS('Product benefit & adoption'!$G$4=\"ALL\",'Product benefit & adoption'!AH54*'Product benefit & adoption'!$P54/1000000,'Product benefit & adoption'!$G$4=\"2020-25\",'Product benefit & adoption'!AH54*'Product benefit & adoption'!$N54/1000000,'Product benefit & adoption'!$G$4=\"2015-20\",'Product benefit & adoption'!AH54*'Product benefit & adoption'!$L54/1000000)","v":0},{"$f":"_xlfn.IFS('Product benefit & adoption'!$G$4=\"ALL\",'Product benefit & adoption'!AI54*'Product benefit & adoption'!$P54/1000000,'Product benefit & adoption'!$G$4=\"2020-25\",'Product benefit & adoption'!AI54*'Product benefit & adoption'!$N54/1000000,'Product benefit & adoption'!$G$4=\"2015-20\",'Product benefit & adoption'!AI54*'Product benefit & adoption'!$L54/1000000)","v":0},{"$f":"_xlfn.IFS('Product benefit & adoption'!$G$4=\"ALL\",'Product benefit & adoption'!AJ54*'Product benefit & adoption'!$P54/1000000,'Product benefit & adoption'!$G$4=\"2020-25\",'Product benefit & adoption'!AJ54*'Product benefit & adoption'!$N54/1000000,'Product benefit & adoption'!$G$4=\"2015-20\",'Product benefit & adoption'!AJ54*'Product benefit & adoption'!$L54/1000000)","v":0},{"$f":"_xlfn.IFS('Product benefit & adoption'!$G$4=\"ALL\",'Product benefit & adoption'!AK54*'Product benefit & adoption'!$P54/1000000,'Product benefit & adoption'!$G$4=\"2020-25\",'Product benefit & adoption'!AK54*'Product benefit & adoption'!$N54/1000000,'Product benefit & adoption'!$G$4=\"2015-20\",'Product benefit & adoption'!AK54*'Product benefit & adoption'!$L54/1000000)","v":0},{"$f":"_xlfn.IFS('Product benefit & adoption'!$G$4=\"ALL\",'Product benefit & adoption'!AL54*'Product benefit & adoption'!$P54/1000000,'Product benefit & adoption'!$G$4=\"2020-25\",'Product benefit & adoption'!AL54*'Product benefit & adoption'!$N54/1000000,'Product benefit & adoption'!$G$4=\"2015-20\",'Product benefit & adoption'!AL54*'Product benefit & adoption'!$L54/1000000)","v":0},{"$f":"_xlfn.IFS('Product benefit & adoption'!$G$4=\"ALL\",'Product benefit & adoption'!AM54*'Product benefit & adoption'!$P54/1000000,'Product benefit & adoption'!$G$4=\"2020-25\",'Product benefit & adoption'!AM54*'Product benefit & adoption'!$N54/1000000,'Product benefit & adoption'!$G$4=\"2015-20\",'Product benefit & adoption'!AM54*'Product benefit & adoption'!$L54/1000000)","v":0},{"$f":"_xlfn.IFS('Product benefit & adoption'!$G$4=\"ALL\",'Product benefit & adoption'!AN54*'Product benefit & adoption'!$P54/1000000,'Product benefit & adoption'!$G$4=\"2020-25\",'Product benefit & adoption'!AN54*'Product benefit & adoption'!$N54/1000000,'Product benefit & adoption'!$G$4=\"2015-20\",'Product benefit & adoption'!AN54*'Product benefit & adoption'!$L54/1000000)","v":0},{"$f":"_xlfn.IFS('Product benefit & adoption'!$G$4=\"ALL\",'Product benefit & adoption'!AO54*'Product benefit & adoption'!$P54/1000000,'Product benefit & adoption'!$G$4=\"2020-25\",'Product benefit & adoption'!AO54*'Product benefit & adoption'!$N54/1000000,'Product benefit & adoption'!$G$4=\"2015-20\",'Product benefit & adoption'!AO54*'Product benefit & adoption'!$L54/1000000)","v":0},{"$f":"_xlfn.IFS('Product benefit & adoption'!$G$4=\"ALL\",'Product benefit & adoption'!AP54*'Product benefit & adoption'!$P54/1000000,'Product benefit & adoption'!$G$4=\"2020-25\",'Product benefit & adoption'!AP54*'Product benefit & adoption'!$N54/1000000,'Product benefit & adoption'!$G$4=\"2015-20\",'Product benefit & adoption'!AP54*'Product benefit & adoption'!$L54/1000000)","v":0},{"$f":"_xlfn.IFS('Product benefit & adoption'!$G$4=\"ALL\",'Product benefit & adoption'!AQ54*'Product benefit & adoption'!$P54/1000000,'Product benefit & adoption'!$G$4=\"2020-25\",'Product benefit & adoption'!AQ54*'Product benefit & adoption'!$N54/1000000,'Product benefit & adoption'!$G$4=\"2015-20\",'Product benefit & adoption'!AQ54*'Product benefit & adoption'!$L54/1000000)","v":0},{"$f":"_xlfn.IFS('Product benefit & adoption'!$G$4=\"ALL\",'Product benefit & adoption'!AR54*'Product benefit & adoption'!$P54/1000000,'Product benefit & adoption'!$G$4=\"2020-25\",'Product benefit & adoption'!AR54*'Product benefit & adoption'!$N54/1000000,'Product benefit & adoption'!$G$4=\"2015-20\",'Product benefit & adoption'!AR54*'Product benefit & adoption'!$L54/1000000)","v":0},{"$f":"_xlfn.IFS('Product benefit & adoption'!$G$4=\"ALL\",'Product benefit & adoption'!AS54*'Product benefit & adoption'!$P54/1000000,'Product benefit & adoption'!$G$4=\"2020-25\",'Product benefit & adoption'!AS54*'Product benefit & adoption'!$N54/1000000,'Product benefit & adoption'!$G$4=\"2015-20\",'Product benefit & adoption'!AS54*'Product benefit & adoption'!$L54/1000000)","v":0},{"$f":"_xlfn.IFS('Product benefit & adoption'!$G$4=\"ALL\",'Product benefit & adoption'!AT54*'Product benefit & adoption'!$P54/1000000,'Product benefit & adoption'!$G$4=\"2020-25\",'Product benefit & adoption'!AT54*'Product benefit & adoption'!$N54/1000000,'Product benefit & adoption'!$G$4=\"2015-20\",'Product benefit & adoption'!AT54*'Product benefit & adoption'!$L54/1000000)","v":0},{"$f":"_xlfn.IFS('Product benefit & adoption'!$G$4=\"ALL\",'Product benefit & adoption'!AU54*'Product benefit & adoption'!$P54/1000000,'Product benefit & adoption'!$G$4=\"2020-25\",'Product benefit & adoption'!AU54*'Product benefit & adoption'!$N54/1000000,'Product benefit & adoption'!$G$4=\"2015-20\",'Product benefit & adoption'!AU54*'Product benefit & adoption'!$L54/1000000)","v":0},{"$f":"_xlfn.IFS('Product benefit & adoption'!$G$4=\"ALL\",'Product benefit & adoption'!AV54*'Product benefit & adoption'!$P54/1000000,'Product benefit & adoption'!$G$4=\"2020-25\",'Product benefit & adoption'!AV54*'Product benefit & adoption'!$N54/1000000,'Product benefit & adoption'!$G$4=\"2015-20\",'Product benefit & adoption'!AV54*'Product benefit & adoption'!$L54/1000000)","v":0},{"$f":"_xlfn.IFS('Product benefit & adoption'!$G$4=\"ALL\",'Product benefit & adoption'!AW54*'Product benefit & adoption'!$P54/1000000,'Product benefit & adoption'!$G$4=\"2020-25\",'Product benefit & adoption'!AW54*'Product benefit & adoption'!$N54/1000000,'Product benefit & adoption'!$G$4=\"2015-20\",'Product benefit & adoption'!AW54*'Product benefit & adoption'!$L54/1000000)","v":0},{"$f":"_xlfn.IFS('Product benefit & adoption'!$G$4=\"ALL\",'Product benefit & adoption'!AX54*'Product benefit & adoption'!$P54/1000000,'Product benefit & adoption'!$G$4=\"2020-25\",'Product benefit & adoption'!AX54*'Product benefit & adoption'!$N54/1000000,'Product benefit & adoption'!$G$4=\"2015-20\",'Product benefit & adoption'!AX54*'Product benefit & adoption'!$L54/1000000)","v":0},{"$f":"_xlfn.IFS('Product benefit & adoption'!$G$4=\"ALL\",'Product benefit & adoption'!AY54*'Product benefit & adoption'!$P54/1000000,'Product benefit & adoption'!$G$4=\"2020-25\",'Product benefit & adoption'!AY54*'Product benefit & adoption'!$N54/1000000,'Product benefit & adoption'!$G$4=\"2015-20\",'Product benefit & adoption'!AY54*'Product benefit & adoption'!$L54/1000000)","v":0},{"$f":"_xlfn.IFS('Product benefit & adoption'!$G$4=\"ALL\",'Product benefit & adoption'!AZ54*'Product benefit & adoption'!$P54/1000000,'Product benefit & adoption'!$G$4=\"2020-25\",'Product benefit & adoption'!AZ54*'Product benefit & adoption'!$N54/1000000,'Product benefit & adoption'!$G$4=\"2015-20\",'Product benefit & adoption'!AZ54*'Product benefit & adoption'!$L54/1000000)","v":0},{"$f":"_xlfn.IFS('Product benefit & adoption'!$G$4=\"ALL\",'Product benefit & adoption'!BA54*'Product benefit & adoption'!$P54/1000000,'Product benefit & adoption'!$G$4=\"2020-25\",'Product benefit & adoption'!BA54*'Product benefit & adoption'!$N54/1000000,'Product benefit & adoption'!$G$4=\"2015-20\",'Product benefit & adoption'!BA54*'Product benefit & adoption'!$L54/1000000)","v":0},{"$f":"_xlfn.IFS('Product benefit & adoption'!$G$4=\"ALL\",'Product benefit & adoption'!BB54*'Product benefit & adoption'!$P54/1000000,'Product benefit & adoption'!$G$4=\"2020-25\",'Product benefit & adoption'!BB54*'Product benefit & adoption'!$N54/1000000,'Product benefit & adoption'!$G$4=\"2015-20\",'Product benefit & adoption'!BB54*'Product benefit & adoption'!$L54/1000000)","v":0},{"$f":"_xlfn.IFS('Product benefit & adoption'!$G$4=\"ALL\",'Product benefit & adoption'!BC54*'Product benefit & adoption'!$P54/1000000,'Product benefit & adoption'!$G$4=\"2020-25\",'Product benefit & adoption'!BC54*'Product benefit & adoption'!$N54/1000000,'Product benefit & adoption'!$G$4=\"2015-20\",'Product benefit & adoption'!BC54*'Product benefit & adoption'!$L54/1000000)","v":0},{"$f":"_xlfn.IFS('Product benefit & adoption'!$G$4=\"ALL\",'Product benefit & adoption'!BD54*'Product benefit & adoption'!$P54/1000000,'Product benefit & adoption'!$G$4=\"2020-25\",'Product benefit & adoption'!BD54*'Product benefit & adoption'!$N54/1000000,'Product benefit & adoption'!$G$4=\"2015-20\",'Product benefit & adoption'!BD54*'Product benefit & adoption'!$L54/1000000)","v":0}]
[null,45,{"$f":"IF('Product benefit & adoption'!D55=\"\",\"\",'Product benefit & adoption'!D55)","v":""},{"$f":"IF('Product benefit & adoption'!F55=\"\",\"\",'Product benefit & adoption'!F55)","v":""},0,{"$f":"_xlfn.IFS('Product benefit & adoption'!$G$4=\"ALL\",'Product benefit & adoption'!AA55*'Product benefit & adoption'!$P55/1000000,'Product benefit & adoption'!$G$4=\"2020-25\",'Product benefit & adoption'!AA55*'Product benefit & adoption'!$N55/1000000,'Product benefit & adoption'!$G$4=\"2015-20\",'Product benefit & adoption'!AA55*'Product benefit & adoption'!$L55/1000000)","v":0},{"$f":"_xlfn.IFS('Product benefit & adoption'!$G$4=\"ALL\",'Product benefit & adoption'!AB55*'Product benefit & adoption'!$P55/1000000,'Product benefit & adoption'!$G$4=\"2020-25\",'Product benefit & adoption'!AB55*'Product benefit & adoption'!$N55/1000000,'Product benefit & adoption'!$G$4=\"2015-20\",'Product benefit & adoption'!AB55*'Product benefit & adoption'!$L55/1000000)","v":0},{"$f":"_xlfn.IFS('Product benefit & adoption'!$G$4=\"ALL\",'Product benefit & adoption'!AC55*'Product benefit & adoption'!$P55/1000000,'Product benefit & adoption'!$G$4=\"2020-25\",'Product benefit & adoption'!AC55*'Product benefit & adoption'!$N55/1000000,'Product benefit & adoption'!$G$4=\"2015-20\",'Product benefit & adoption'!AC55*'Product benefit & adoption'!$L55/1000000)","v":0},{"$f":"_xlfn.IFS('Product benefit & adoption'!$G$4=\"ALL\",'Product benefit & adoption'!AD55*'Product benefit & adoption'!$P55/1000000,'Product benefit & adoption'!$G$4=\"2020-25\",'Product benefit & adoption'!AD55*'Product benefit & adoption'!$N55/1000000,'Product benefit & adoption'!$G$4=\"2015-20\",'Product benefit & adoption'!AD55*'Product benefit & adoption'!$L55/1000000)","v":0},{"$f":"_xlfn.IFS('Product benefit & adoption'!$G$4=\"ALL\",'Product benefit & adoption'!AE55*'Product benefit & adoption'!$P55/1000000,'Product benefit & adoption'!$G$4=\"2020-25\",'Product benefit & adoption'!AE55*'Product benefit & adoption'!$N55/1000000,'Product benefit & adoption'!$G$4=\"2015-20\",'Product benefit & adoption'!AE55*'Product benefit & adoption'!$L55/1000000)","v":0},{"$f":"_xlfn.IFS('Product benefit & adoption'!$G$4=\"ALL\",'Product benefit & adoption'!AF55*'Product benefit & adoption'!$P55/1000000,'Product benefit & adoption'!$G$4=\"2020-25\",'Product benefit & adoption'!AF55*'Product benefit & adoption'!$N55/1000000,'Product benefit & adoption'!$G$4=\"2015-20\",'Product benefit & adoption'!AF55*'Product benefit & adoption'!$L55/1000000)","v":0},{"$f":"_xlfn.IFS('Product benefit & adoption'!$G$4=\"ALL\",'Product benefit & adoption'!AG55*'Product benefit & adoption'!$P55/1000000,'Product benefit & adoption'!$G$4=\"2020-25\",'Product benefit & adoption'!AG55*'Product benefit & adoption'!$N55/1000000,'Product benefit & adoption'!$G$4=\"2015-20\",'Product benefit & adoption'!AG55*'Product benefit & adoption'!$L55/1000000)","v":0},{"$f":"_xlfn.IFS('Product benefit & adoption'!$G$4=\"ALL\",'Product benefit & adoption'!AH55*'Product benefit & adoption'!$P55/1000000,'Product benefit & adoption'!$G$4=\"2020-25\",'Product benefit & adoption'!AH55*'Product benefit & adoption'!$N55/1000000,'Product benefit & adoption'!$G$4=\"2015-20\",'Product benefit & adoption'!AH55*'Product benefit & adoption'!$L55/1000000)","v":0},{"$f":"_xlfn.IFS('Product benefit & adoption'!$G$4=\"ALL\",'Product benefit & adoption'!AI55*'Product benefit & adoption'!$P55/1000000,'Product benefit & adoption'!$G$4=\"2020-25\",'Product benefit & adoption'!AI55*'Product benefit & adoption'!$N55/1000000,'Product benefit & adoption'!$G$4=\"2015-20\",'Product benefit & adoption'!AI55*'Product benefit & adoption'!$L55/1000000)","v":0},{"$f":"_xlfn.IFS('Product benefit & adoption'!$G$4=\"ALL\",'Product benefit & adoption'!AJ55*'Product benefit & adoption'!$P55/1000000,'Product benefit & adoption'!$G$4=\"2020-25\",'Product benefit & adoption'!AJ55*'Product benefit & adoption'!$N55/1000000,'Product benefit & adoption'!$G$4=\"2015-20\",'Product benefit & adoption'!AJ55*'Product benefit & adoption'!$L55/1000000)","v":0},{"$f":"_xlfn.IFS('Product benefit & adoption'!$G$4=\"ALL\",'Product benefit & adoption'!AK55*'Product benefit & adoption'!$P55/1000000,'Product benefit & adoption'!$G$4=\"2020-25\",'Product benefit & adoption'!AK55*'Product benefit & adoption'!$N55/1000000,'Product benefit & adoption'!$G$4=\"2015-20\",'Product benefit & adoption'!AK55*'Product benefit & adoption'!$L55/1000000)","v":0},{"$f":"_xlfn.IFS('Product benefit & adoption'!$G$4=\"ALL\",'Product benefit & adoption'!AL55*'Product benefit & adoption'!$P55/1000000,'Product benefit & adoption'!$G$4=\"2020-25\",'Product benefit & adoption'!AL55*'Product benefit & adoption'!$N55/1000000,'Product benefit & adoption'!$G$4=\"2015-20\",'Product benefit & adoption'!AL55*'Product benefit & adoption'!$L55/1000000)","v":0},{"$f":"_xlfn.IFS('Product benefit & adoption'!$G$4=\"ALL\",'Product benefit & adoption'!AM55*'Product benefit & adoption'!$P55/1000000,'Product benefit & adoption'!$G$4=\"2020-25\",'Product benefit & adoption'!AM55*'Product benefit & adoption'!$N55/1000000,'Product benefit & adoption'!$G$4=\"2015-20\",'Product benefit & adoption'!AM55*'Product benefit & adoption'!$L55/1000000)","v":0},{"$f":"_xlfn.IFS('Product benefit & adoption'!$G$4=\"ALL\",'Product benefit & adoption'!AN55*'Product benefit & adoption'!$P55/1000000,'Product benefit & adoption'!$G$4=\"2020-25\",'Product benefit & adoption'!AN55*'Product benefit & adoption'!$N55/1000000,'Product benefit & adoption'!$G$4=\"2015-20\",'Product benefit & adoption'!AN55*'Product benefit & adoption'!$L55/1000000)","v":0},{"$f":"_xlfn.IFS('Product benefit & adoption'!$G$4=\"ALL\",'Product benefit & adoption'!AO55*'Product benefit & adoption'!$P55/1000000,'Product benefit & adoption'!$G$4=\"2020-25\",'Product benefit & adoption'!AO55*'Product benefit & adoption'!$N55/1000000,'Product benefit & adoption'!$G$4=\"2015-20\",'Product benefit & adoption'!AO55*'Product benefit & adoption'!$L55/1000000)","v":0},{"$f":"_xlfn.IFS('Product benefit & adoption'!$G$4=\"ALL\",'Product benefit & adoption'!AP55*'Product benefit & adoption'!$P55/1000000,'Product benefit & adoption'!$G$4=\"2020-25\",'Product benefit & adoption'!AP55*'Product benefit & adoption'!$N55/1000000,'Product benefit & adoption'!$G$4=\"2015-20\",'Product benefit & adoption'!AP55*'Product benefit & adoption'!$L55/1000000)","v":0},{"$f":"_xlfn.IFS('Product benefit & adoption'!$G$4=\"ALL\",'Product benefit & adoption'!AQ55*'Product benefit & adoption'!$P55/1000000,'Product benefit & adoption'!$G$4=\"2020-25\",'Product benefit & adoption'!AQ55*'Product benefit & adoption'!$N55/1000000,'Product benefit & adoption'!$G$4=\"2015-20\",'Product benefit & adoption'!AQ55*'Product benefit & adoption'!$L55/1000000)","v":0},{"$f":"_xlfn.IFS('Product benefit & adoption'!$G$4=\"ALL\",'Product benefit & adoption'!AR55*'Product benefit & adoption'!$P55/1000000,'Product benefit & adoption'!$G$4=\"2020-25\",'Product benefit & adoption'!AR55*'Product benefit & adoption'!$N55/1000000,'Product benefit & adoption'!$G$4=\"2015-20\",'Product benefit & adoption'!AR55*'Product benefit & adoption'!$L55/1000000)","v":0},{"$f":"_xlfn.IFS('Product benefit & adoption'!$G$4=\"ALL\",'Product benefit & adoption'!AS55*'Product benefit & adoption'!$P55/1000000,'Product benefit & adoption'!$G$4=\"2020-25\",'Product benefit & adoption'!AS55*'Product benefit & adoption'!$N55/1000000,'Product benefit & adoption'!$G$4=\"2015-20\",'Product benefit & adoption'!AS55*'Product benefit & adoption'!$L55/1000000)","v":0},{"$f":"_xlfn.IFS('Product benefit & adoption'!$G$4=\"ALL\",'Product benefit & adoption'!AT55*'Product benefit & adoption'!$P55/1000000,'Product benefit & adoption'!$G$4=\"2020-25\",'Product benefit & adoption'!AT55*'Product benefit & adoption'!$N55/1000000,'Product benefit & adoption'!$G$4=\"2015-20\",'Product benefit & adoption'!AT55*'Product benefit & adoption'!$L55/1000000)","v":0},{"$f":"_xlfn.IFS('Product benefit & adoption'!$G$4=\"ALL\",'Product benefit & adoption'!AU55*'Product benefit & adoption'!$P55/1000000,'Product benefit & adoption'!$G$4=\"2020-25\",'Product benefit & adoption'!AU55*'Product benefit & adoption'!$N55/1000000,'Product benefit & adoption'!$G$4=\"2015-20\",'Product benefit & adoption'!AU55*'Product benefit & adoption'!$L55/1000000)","v":0},{"$f":"_xlfn.IFS('Product benefit & adoption'!$G$4=\"ALL\",'Product benefit & adoption'!AV55*'Product benefit & adoption'!$P55/1000000,'Product benefit & adoption'!$G$4=\"2020-25\",'Product benefit & adoption'!AV55*'Product benefit & adoption'!$N55/1000000,'Product benefit & adoption'!$G$4=\"2015-20\",'Product benefit & adoption'!AV55*'Product benefit & adoption'!$L55/1000000)","v":0},{"$f":"_xlfn.IFS('Product benefit & adoption'!$G$4=\"ALL\",'Product benefit & adoption'!AW55*'Product benefit & adoption'!$P55/1000000,'Product benefit & adoption'!$G$4=\"2020-25\",'Product benefit & adoption'!AW55*'Product benefit & adoption'!$N55/1000000,'Product benefit & adoption'!$G$4=\"2015-20\",'Product benefit & adoption'!AW55*'Product benefit & adoption'!$L55/1000000)","v":0},{"$f":"_xlfn.IFS('Product benefit & adoption'!$G$4=\"ALL\",'Product benefit & adoption'!AX55*'Product benefit & adoption'!$P55/1000000,'Product benefit & adoption'!$G$4=\"2020-25\",'Product benefit & adoption'!AX55*'Product benefit & adoption'!$N55/1000000,'Product benefit & adoption'!$G$4=\"2015-20\",'Product benefit & adoption'!AX55*'Product benefit & adoption'!$L55/1000000)","v":0},{"$f":"_xlfn.IFS('Product benefit & adoption'!$G$4=\"ALL\",'Product benefit & adoption'!AY55*'Product benefit & adoption'!$P55/1000000,'Product benefit & adoption'!$G$4=\"2020-25\",'Product benefit & adoption'!AY55*'Product benefit & adoption'!$N55/1000000,'Product benefit & adoption'!$G$4=\"2015-20\",'Product benefit & adoption'!AY55*'Product benefit & adoption'!$L55/1000000)","v":0},{"$f":"_xlfn.IFS('Product benefit & adoption'!$G$4=\"ALL\",'Product benefit & adoption'!AZ55*'Product benefit & adoption'!$P55/1000000,'Product benefit & adoption'!$G$4=\"2020-25\",'Product benefit & adoption'!AZ55*'Product benefit & adoption'!$N55/1000000,'Product benefit & adoption'!$G$4=\"2015-20\",'Product benefit & adoption'!AZ55*'Product benefit & adoption'!$L55/1000000)","v":0},{"$f":"_xlfn.IFS('Product benefit & adoption'!$G$4=\"ALL\",'Product benefit & adoption'!BA55*'Product benefit & adoption'!$P55/1000000,'Product benefit & adoption'!$G$4=\"2020-25\",'Product benefit & adoption'!BA55*'Product benefit & adoption'!$N55/1000000,'Product benefit & adoption'!$G$4=\"2015-20\",'Product benefit & adoption'!BA55*'Product benefit & adoption'!$L55/1000000)","v":0},{"$f":"_xlfn.IFS('Product benefit & adoption'!$G$4=\"ALL\",'Product benefit & adoption'!BB55*'Product benefit & adoption'!$P55/1000000,'Product benefit & adoption'!$G$4=\"2020-25\",'Product benefit & adoption'!BB55*'Product benefit & adoption'!$N55/1000000,'Product benefit & adoption'!$G$4=\"2015-20\",'Product benefit & adoption'!BB55*'Product benefit & adoption'!$L55/1000000)","v":0},{"$f":"_xlfn.IFS('Product benefit & adoption'!$G$4=\"ALL\",'Product benefit & adoption'!BC55*'Product benefit & adoption'!$P55/1000000,'Product benefit & adoption'!$G$4=\"2020-25\",'Product benefit & adoption'!BC55*'Product benefit & adoption'!$N55/1000000,'Product benefit & adoption'!$G$4=\"2015-20\",'Product benefit & adoption'!BC55*'Product benefit & adoption'!$L55/1000000)","v":0},{"$f":"_xlfn.IFS('Product benefit & adoption'!$G$4=\"ALL\",'Product benefit & adoption'!BD55*'Product benefit & adoption'!$P55/1000000,'Product benefit & adoption'!$G$4=\"2020-25\",'Product benefit & adoption'!BD55*'Product benefit & adoption'!$N55/1000000,'Product benefit & adoption'!$G$4=\"2015-20\",'Product benefit & adoption'!BD55*'Product benefit & adoption'!$L55/1000000)","v":0}]
[null,46,{"$f":"IF('Product benefit & adoption'!D56=\"\",\"\",'Product benefit & adoption'!D56)","v":""},{"$f":"IF('Product benefit & adoption'!F56=\"\",\"\",'Product benefit & adoption'!F56)","v":""},0,{"$f":"_xlfn.IFS('Product benefit & adoption'!$G$4=\"ALL\",'Product benefit & adoption'!AA56*'Product benefit & adoption'!$P56/1000000,'Product benefit & adoption'!$G$4=\"2020-25\",'Product benefit & adoption'!AA56*'Product benefit & adoption'!$N56/1000000,'Product benefit & adoption'!$G$4=\"2015-20\",'Product benefit & adoption'!AA56*'Product benefit & adoption'!$L56/1000000)","v":0},{"$f":"_xlfn.IFS('Product benefit & adoption'!$G$4=\"ALL\",'Product benefit & adoption'!AB56*'Product benefit & adoption'!$P56/1000000,'Product benefit & adoption'!$G$4=\"2020-25\",'Product benefit & adoption'!AB56*'Product benefit & adoption'!$N56/1000000,'Product benefit & adoption'!$G$4=\"2015-20\",'Product benefit & adoption'!AB56*'Product benefit & adoption'!$L56/1000000)","v":0},{"$f":"_xlfn.IFS('Product benefit & adoption'!$G$4=\"ALL\",'Product benefit & adoption'!AC56*'Product benefit & adoption'!$P56/1000000,'Product benefit & adoption'!$G$4=\"2020-25\",'Product benefit & adoption'!AC56*'Product benefit & adoption'!$N56/1000000,'Product benefit & adoption'!$G$4=\"2015-20\",'Product benefit & adoption'!AC56*'Product benefit & adoption'!$L56/1000000)","v":0},{"$f":"_xlfn.IFS('Product benefit & adoption'!$G$4=\"ALL\",'Product benefit & adoption'!AD56*'Product benefit & adoption'!$P56/1000000,'Product benefit & adoption'!$G$4=\"2020-25\",'Product benefit & adoption'!AD56*'Product benefit & adoption'!$N56/1000000,'Product benefit & adoption'!$G$4=\"2015-20\",'Product benefit & adoption'!AD56*'Product benefit & adoption'!$L56/1000000)","v":0},{"$f":"_xlfn.IFS('Product benefit & adoption'!$G$4=\"ALL\",'Product benefit & adoption'!AE56*'Product benefit & adoption'!$P56/1000000,'Product benefit & adoption'!$G$4=\"2020-25\",'Product benefit & adoption'!AE56*'Product benefit & adoption'!$N56/1000000,'Product benefit & adoption'!$G$4=\"2015-20\",'Product benefit & adoption'!AE56*'Product benefit & adoption'!$L56/1000000)","v":0},{"$f":"_xlfn.IFS('Product benefit & adoption'!$G$4=\"ALL\",'Product benefit & adoption'!AF56*'Product benefit & adoption'!$P56/1000000,'Product benefit & adoption'!$G$4=\"2020-25\",'Product benefit & adoption'!AF56*'Product benefit & adoption'!$N56/1000000,'Product benefit & adoption'!$G$4=\"2015-20\",'Product benefit & adoption'!AF56*'Product benefit & adoption'!$L56/1000000)","v":0},{"$f":"_xlfn.IFS('Product benefit & adoption'!$G$4=\"ALL\",'Product benefit & adoption'!AG56*'Product benefit & adoption'!$P56/1000000,'Product benefit & adoption'!$G$4=\"2020-25\",'Product benefit & adoption'!AG56*'Product benefit & adoption'!$N56/1000000,'Product benefit & adoption'!$G$4=\"2015-20\",'Product benefit & adoption'!AG56*'Product benefit & adoption'!$L56/1000000)","v":0},{"$f":"_xlfn.IFS('Product benefit & adoption'!$G$4=\"ALL\",'Product benefit & adoption'!AH56*'Product benefit & adoption'!$P56/1000000,'Product benefit & adoption'!$G$4=\"2020-25\",'Product benefit & adoption'!AH56*'Product benefit & adoption'!$N56/1000000,'Product benefit & adoption'!$G$4=\"2015-20\",'Product benefit & adoption'!AH56*'Product benefit & adoption'!$L56/1000000)","v":0},{"$f":"_xlfn.IFS('Product benefit & adoption'!$G$4=\"ALL\",'Product benefit & adoption'!AI56*'Product benefit & adoption'!$P56/1000000,'Product benefit & adoption'!$G$4=\"2020-25\",'Product benefit & adoption'!AI56*'Product benefit & adoption'!$N56/1000000,'Product benefit & adoption'!$G$4=\"2015-20\",'Product benefit & adoption'!AI56*'Product benefit & adoption'!$L56/1000000)","v":0},{"$f":"_xlfn.IFS('Product benefit & adoption'!$G$4=\"ALL\",'Product benefit & adoption'!AJ56*'Product benefit & adoption'!$P56/1000000,'Product benefit & adoption'!$G$4=\"2020-25\",'Product benefit & adoption'!AJ56*'Product benefit & adoption'!$N56/1000000,'Product benefit & adoption'!$G$4=\"2015-20\",'Product benefit & adoption'!AJ56*'Product benefit & adoption'!$L56/1000000)","v":0},{"$f":"_xlfn.IFS('Product benefit & adoption'!$G$4=\"ALL\",'Product benefit & adoption'!AK56*'Product benefit & adoption'!$P56/1000000,'Product benefit & adoption'!$G$4=\"2020-25\",'Product benefit & adoption'!AK56*'Product benefit & adoption'!$N56/1000000,'Product benefit & adoption'!$G$4=\"2015-20\",'Product benefit & adoption'!AK56*'Product benefit & adoption'!$L56/1000000)","v":0},{"$f":"_xlfn.IFS('Product benefit & adoption'!$G$4=\"ALL\",'Product benefit & adoption'!AL56*'Product benefit & adoption'!$P56/1000000,'Product benefit & adoption'!$G$4=\"2020-25\",'Product benefit & adoption'!AL56*'Product benefit & adoption'!$N56/1000000,'Product benefit & adoption'!$G$4=\"2015-20\",'Product benefit & adoption'!AL56*'Product benefit & adoption'!$L56/1000000)","v":0},{"$f":"_xlfn.IFS('Product benefit & adoption'!$G$4=\"ALL\",'Product benefit & adoption'!AM56*'Product benefit & adoption'!$P56/1000000,'Product benefit & adoption'!$G$4=\"2020-25\",'Product benefit & adoption'!AM56*'Product benefit & adoption'!$N56/1000000,'Product benefit & adoption'!$G$4=\"2015-20\",'Product benefit & adoption'!AM56*'Product benefit & adoption'!$L56/1000000)","v":0},{"$f":"_xlfn.IFS('Product benefit & adoption'!$G$4=\"ALL\",'Product benefit & adoption'!AN56*'Product benefit & adoption'!$P56/1000000,'Product benefit & adoption'!$G$4=\"2020-25\",'Product benefit & adoption'!AN56*'Product benefit & adoption'!$N56/1000000,'Product benefit & adoption'!$G$4=\"2015-20\",'Product benefit & adoption'!AN56*'Product benefit & adoption'!$L56/1000000)","v":0},{"$f":"_xlfn.IFS('Product benefit & adoption'!$G$4=\"ALL\",'Product benefit & adoption'!AO56*'Product benefit & adoption'!$P56/1000000,'Product benefit & adoption'!$G$4=\"2020-25\",'Product benefit & adoption'!AO56*'Product benefit & adoption'!$N56/1000000,'Product benefit & adoption'!$G$4=\"2015-20\",'Product benefit & adoption'!AO56*'Product benefit & adoption'!$L56/1000000)","v":0},{"$f":"_xlfn.IFS('Product benefit & adoption'!$G$4=\"ALL\",'Product benefit & adoption'!AP56*'Product benefit & adoption'!$P56/1000000,'Product benefit & adoption'!$G$4=\"2020-25\",'Product benefit & adoption'!AP56*'Product benefit & adoption'!$N56/1000000,'Product benefit & adoption'!$G$4=\"2015-20\",'Product benefit & adoption'!AP56*'Product benefit & adoption'!$L56/1000000)","v":0},{"$f":"_xlfn.IFS('Product benefit & adoption'!$G$4=\"ALL\",'Product benefit & adoption'!AQ56*'Product benefit & adoption'!$P56/1000000,'Product benefit & adoption'!$G$4=\"2020-25\",'Product benefit & adoption'!AQ56*'Product benefit & adoption'!$N56/1000000,'Product benefit & adoption'!$G$4=\"2015-20\",'Product benefit & adoption'!AQ56*'Product benefit & adoption'!$L56/1000000)","v":0},{"$f":"_xlfn.IFS('Product benefit & adoption'!$G$4=\"ALL\",'Product benefit & adoption'!AR56*'Product benefit & adoption'!$P56/1000000,'Product benefit & adoption'!$G$4=\"2020-25\",'Product benefit & adoption'!AR56*'Product benefit & adoption'!$N56/1000000,'Product benefit & adoption'!$G$4=\"2015-20\",'Product benefit & adoption'!AR56*'Product benefit & adoption'!$L56/1000000)","v":0},{"$f":"_xlfn.IFS('Product benefit & adoption'!$G$4=\"ALL\",'Product benefit & adoption'!AS56*'Product benefit & adoption'!$P56/1000000,'Product benefit & adoption'!$G$4=\"2020-25\",'Product benefit & adoption'!AS56*'Product benefit & adoption'!$N56/1000000,'Product benefit & adoption'!$G$4=\"2015-20\",'Product benefit & adoption'!AS56*'Product benefit & adoption'!$L56/1000000)","v":0},{"$f":"_xlfn.IFS('Product benefit & adoption'!$G$4=\"ALL\",'Product benefit & adoption'!AT56*'Product benefit & adoption'!$P56/1000000,'Product benefit & adoption'!$G$4=\"2020-25\",'Product benefit & adoption'!AT56*'Product benefit & adoption'!$N56/1000000,'Product benefit & adoption'!$G$4=\"2015-20\",'Product benefit & adoption'!AT56*'Product benefit & adoption'!$L56/1000000)","v":0},{"$f":"_xlfn.IFS('Product benefit & adoption'!$G$4=\"ALL\",'Product benefit & adoption'!AU56*'Product benefit & adoption'!$P56/1000000,'Product benefit & adoption'!$G$4=\"2020-25\",'Product benefit & adoption'!AU56*'Product benefit & adoption'!$N56/1000000,'Product benefit & adoption'!$G$4=\"2015-20\",'Product benefit & adoption'!AU56*'Product benefit & adoption'!$L56/1000000)","v":0},{"$f":"_xlfn.IFS('Product benefit & adoption'!$G$4=\"ALL\",'Product benefit & adoption'!AV56*'Product benefit & adoption'!$P56/1000000,'Product benefit & adoption'!$G$4=\"2020-25\",'Product benefit & adoption'!AV56*'Product benefit & adoption'!$N56/1000000,'Product benefit & adoption'!$G$4=\"2015-20\",'Product benefit & adoption'!AV56*'Product benefit & adoption'!$L56/1000000)","v":0},{"$f":"_xlfn.IFS('Product benefit & adoption'!$G$4=\"ALL\",'Product benefit & adoption'!AW56*'Product benefit & adoption'!$P56/1000000,'Product benefit & adoption'!$G$4=\"2020-25\",'Product benefit & adoption'!AW56*'Product benefit & adoption'!$N56/1000000,'Product benefit & adoption'!$G$4=\"2015-20\",'Product benefit & adoption'!AW56*'Product benefit & adoption'!$L56/1000000)","v":0},{"$f":"_xlfn.IFS('Product benefit & adoption'!$G$4=\"ALL\",'Product benefit & adoption'!AX56*'Product benefit & adoption'!$P56/1000000,'Product benefit & adoption'!$G$4=\"2020-25\",'Product benefit & adoption'!AX56*'Product benefit & adoption'!$N56/1000000,'Product benefit & adoption'!$G$4=\"2015-20\",'Product benefit & adoption'!AX56*'Product benefit & adoption'!$L56/1000000)","v":0},{"$f":"_xlfn.IFS('Product benefit & adoption'!$G$4=\"ALL\",'Product benefit & adoption'!AY56*'Product benefit & adoption'!$P56/1000000,'Product benefit & adoption'!$G$4=\"2020-25\",'Product benefit & adoption'!AY56*'Product benefit & adoption'!$N56/1000000,'Product benefit & adoption'!$G$4=\"2015-20\",'Product benefit & adoption'!AY56*'Product benefit & adoption'!$L56/1000000)","v":0},{"$f":"_xlfn.IFS('Product benefit & adoption'!$G$4=\"ALL\",'Product benefit & adoption'!AZ56*'Product benefit & adoption'!$P56/1000000,'Product benefit & adoption'!$G$4=\"2020-25\",'Product benefit & adoption'!AZ56*'Product benefit & adoption'!$N56/1000000,'Product benefit & adoption'!$G$4=\"2015-20\",'Product benefit & adoption'!AZ56*'Product benefit & adoption'!$L56/1000000)","v":0},{"$f":"_xlfn.IFS('Product benefit & adoption'!$G$4=\"ALL\",'Product benefit & adoption'!BA56*'Product benefit & adoption'!$P56/1000000,'Product benefit & adoption'!$G$4=\"2020-25\",'Product benefit & adoption'!BA56*'Product benefit & adoption'!$N56/1000000,'Product benefit & adoption'!$G$4=\"2015-20\",'Product benefit & adoption'!BA56*'Product benefit & adoption'!$L56/1000000)","v":0},{"$f":"_xlfn.IFS('Product benefit & adoption'!$G$4=\"ALL\",'Product benefit & adoption'!BB56*'Product benefit & adoption'!$P56/1000000,'Product benefit & adoption'!$G$4=\"2020-25\",'Product benefit & adoption'!BB56*'Product benefit & adoption'!$N56/1000000,'Product benefit & adoption'!$G$4=\"2015-20\",'Product benefit & adoption'!BB56*'Product benefit & adoption'!$L56/1000000)","v":0},{"$f":"_xlfn.IFS('Product benefit & adoption'!$G$4=\"ALL\",'Product benefit & adoption'!BC56*'Product benefit & adoption'!$P56/1000000,'Product benefit & adoption'!$G$4=\"2020-25\",'Product benefit & adoption'!BC56*'Product benefit & adoption'!$N56/1000000,'Product benefit & adoption'!$G$4=\"2015-20\",'Product benefit & adoption'!BC56*'Product benefit & adoption'!$L56/1000000)","v":0},{"$f":"_xlfn.IFS('Product benefit & adoption'!$G$4=\"ALL\",'Product benefit & adoption'!BD56*'Product benefit & adoption'!$P56/1000000,'Product benefit & adoption'!$G$4=\"2020-25\",'Product benefit & adoption'!BD56*'Product benefit & adoption'!$N56/1000000,'Product benefit & adoption'!$G$4=\"2015-20\",'Product benefit & adoption'!BD56*'Product benefit & adoption'!$L56/1000000)","v":0}]
[null,null,"Total benefits (before 5% NPV adjustment)",null,{"$f":"SUM(E6:E51)","v":280.09999999999997},{"$f":"SUM(F6:F51)","v":0},{"$f":"SUM(G6:G51)","v":0},0,0,0,0.30000000000000004,1.1000000000000001,2.2000000000000002,5.3,5.5,5.7,6,7,7.9,8.8000000000000007,9.6999999999999993,10.6,11.5,12.5,13.5,14.5,15.5,16.5,17.5,18.5,18,18,18,18,18]
[]
[]
[null,"Item","Product Group","Output (Product)",{"$f":"\"SUM Period (PV):\"&\" \"&TEXT('Product benefit & adoption'!$G$4,2)","v":"SUM Period (PV): ALL"},"2015-16","2016-17","2017-18","2018-19","2019-20","2020-21","2021-22","2022-23","2023-24","2024-25","2025-26","2026-27","2027-28","2028-29","2029-30","2030-31","2031-32","2032-33","2033-34","2034-35","2035-36","2036-37","2037-38","2038-39","2039-40","2040-41","2041-42","2042-43","2043-44","2044-45"]
[null,null,null,null,"$m","$m","$m","$m","$m","$m","$m","$m","$m","$m","$m","$m","$m","$m","$m","$m","$m","$m","$m","$m","$m","$m","$m","$m","$m","$m","$m","$m","$m","$m","$m"]
[null,1,{"$f":"IF('Product benefit & adoption'!D11=\"\",\"\",'Product benefit & adoption'!D11)","v":"Pasture variety"},{"$f":"IF('Product benefit & adoption'!F11=\"\",\"\",'Product benefit & adoption'!F11)","v":"e.g Tropical pastures into  temperate zone\n\n"},{"$f":"_xlfn.IFS('Product benefit & adoption'!$G$4=\"ALL\",SUM(F57:AI57),'Product benefit & adoption'!$G$4=\"2020-25\",SUM(K57:AI57),'Product benefit & adoption'!$G$4=\"2015-20\",SUM(F57:AD57))","v":7.5492080954729062},{"$f":"F6*'PV calculation'!U$23","v":0},{"$f":"G6*'PV calculation'!V$23","v":0},{"$f":"H6*'PV calculation'!W$23","v":0},{"$f":"I6*'PV calculation'!X$23","v":0},{"$f":"J6*'PV calculation'!Y$23","v":0},{"$f":"K6*'PV calculation'!Z$23","v":0.11025000000000001},{"$f":"L6*'PV calculation'!AA$23","v":0.10500000000000001},{"$f":"M6*'PV calculation'!AB$23","v":0.2},{"$f":"N6*'PV calculation'!AC$23","v":0.2857142857142857},{"$f":"O6*'PV calculation'!AD$23","v":0.45351473922902491},{"$f":"P6*'PV calculation'!AE$23","v":0.60468631897203318},{"$f":"Q6*'PV calculation'!AF$23","v":0.82270247479188197},{"$f":"R6*'PV calculation'!AG$23","v":0.78352616646845896},{"$f":"S6*'PV calculation'!AH$23","v":0.67159385697296492},{"$f":"T6*'PV calculation'!AI$23","v":0.56854506410409722},{"$f":"U6*'PV calculation'!AJ$23","v":0.473787553420081},{"$f":"V6*'PV calculation'!AK$23","v":0.38676534973067833},{"$f":"W6*'PV calculation'!AL$23","v":0.30695662677037966},{"$f":"X6*'PV calculation'!AM$23","v":0.2923396445432187},{"$f":"Y6*'PV calculation'!AN$23","v":0.27841870908877975},{"$f":"Z6*'PV calculation'!AO$23","v":0.26516067532264731},{"$f":"AA6*'PV calculation'!AP$23","v":0.25253397649775944},{"$f":"AB6*'PV calculation'!AQ$23","v":0.2405085490454851},{"$f":"AC6*'PV calculation'!AR$23","v":0.2290557609957001},{"$f":"AD6*'PV calculation'!AS$23","v":0.21814834380542864},{"$f":"AE6*'PV calculation'!AT$23","v":0},{"$f":"AF6*'PV calculation'!AU$23","v":0},{"$f":"AG6*'PV calculation'!AV$23","v":0},{"$f":"AH6*'PV calculation'!AW$23","v":0},{"$f":"AI6*'PV calculation'!AX$23","v":0}]
[null,2,{"$f":"IF('Product benefit & adoption'!D12=\"\",\"\",'Product benefit & adoption'!D12)","v":"Reproductive efficiency"},{"$f":"IF('Product benefit & adoption'!F12=\"\",\"\",'Product benefit & adoption'!F12)","v":"e.g. Calf survival/weaning productivity tools, practices and extension program"},{"$f":"_xlfn.IFS('Product benefit & adoption'!$G$4=\"ALL\",SUM(F58:AI58),'Product benefit & adoption'!$G$4=\"2020-25\",SUM(K58:AI58),'Product benefit & adoption'!$G$4=\"2015-20\",SUM(F58:AD58))","v":142.49497702484638},{"$f":"F7*'PV calculation'!U$23","v":0},{"$f":"G7*'PV calculation'!V$23","v":0},{"$f":"H7*'PV calculation'!W$23","v":0},{"$f":"I7*'PV calculation'!X$23","v":0},{"$f":"J7*'PV calculation'!Y$23","v":0},{"$f":"K7*'PV calculation'!Z$23","v":0.22050000000000003},{"$f":"L7*'PV calculation'!AA$23","v":1.05},{"$f":"M7*'PV calculation'!AB$23","v":2},{"$f":"N7*'PV calculation'!AC$23","v":4.7619047619047619},{"$f":"O7*'PV calculation'!AD$23","v":4.5351473922902494},{"$f":"P7*'PV calculation'!AE$23","v":4.3191879926573797},{"$f":"Q7*'PV calculation'!AF$23","v":4.1135123739594102},{"$f":"R7*'PV calculation'!AG$23","v":4.7011569988107542},{"$f":"S7*'PV calculation'!AH$23","v":5.2235077764563931},{"$f":"T7*'PV calculation'!AI$23","v":5.6854506410409718},{"$f":"U7*'PV calculation'!AJ$23","v":6.091554258258185},{"$f":"V7*'PV calculation'!AK$23","v":6.446089162177973},{"$f":"W7*'PV calculation'!AL$23","v":6.7530457889483522},{"$f":"X7*'PV calculation'!AM$23","v":7.0161514690372488},{"$f":"Y7*'PV calculation'!AN$23","v":7.2388864363082739},{"$f":"Z7*'PV calculation'!AO$23","v":7.4244989090341242},{"$f":"AA7*'PV calculation'!AP$23","v":7.5760192949327827},{"$f":"AB7*'PV calculation'!AQ$23","v":7.6962735694555233},{"$f":"AC7*'PV calculation'!AR$23","v":7.7878958738538033},{"$f":"AD7*'PV calculation'!AS$23","v":7.8533403769954306},{"$f":"AE7*'PV calculation'!AT$23","v":7.4793717876146966},{"$f":"AF7*'PV calculation'!AU$23","v":7.1232112262997109},{"$f":"AG7*'PV calculation'!AV$23","v":6.7840106917140108},{"$f":"AH7*'PV calculation'!AW$23","v":6.4609625635371533},{"$f":"AI7*'PV calculation'!AX$23","v":6.153297679559194}]
[null,3,{"$f":"IF('Product benefit & adoption'!D13=\"\",\"\",'Product benefit & adoption'!D13)","v":""},{"$f":"IF('Product benefit & adoption'!F13=\"\",\"\",'Product benefit & adoption'!F13)","v":""},{"$f":"_xlfn.IFS('Product benefit & adoption'!$G$4=\"ALL\",SUM(F59:AI59),'Product benefit & adoption'!$G$4=\"2020-25\",SUM(K59:AI59),'Product benefit & adoption'!$G$4=\"2015-20\",SUM(F59:AD59))","v":0},{"$f":"F8*'PV calculation'!U$23","v":0},{"$f":"G8*'PV calculation'!V$23","v":0},{"$f":"H8*'PV calculation'!W$23","v":0},{"$f":"I8*'PV calculation'!X$23","v":0},{"$f":"J8*'PV calculation'!Y$23","v":0},{"$f":"K8*'PV calculation'!Z$23","v":0},{"$f":"L8*'PV calculation'!AA$23","v":0},{"$f":"M8*'PV calculation'!AB$23","v":0},{"$f":"N8*'PV calculation'!AC$23","v":0},{"$f":"O8*'PV calculation'!AD$23","v":0},{"$f":"P8*'PV calculation'!AE$23","v":0},{"$f":"Q8*'PV calculation'!AF$23","v":0},{"$f":"R8*'PV calculation'!AG$23","v":0},{"$f":"S8*'PV calculation'!AH$23","v":0},{"$f":"T8*'PV calculation'!AI$23","v":0},{"$f":"U8*'PV calculation'!AJ$23","v":0},{"$f":"V8*'PV calculation'!AK$23","v":0},{"$f":"W8*'PV calculation'!AL$23","v":0},{"$f":"X8*'PV calculation'!AM$23","v":0},{"$f":"Y8*'PV calculation'!AN$23","v":0},{"$f":"Z8*'PV calculation'!AO$23","v":0},{"$f":"AA8*'PV calculation'!AP$23","v":0},{"$f":"AB8*'PV calculation'!AQ$23","v":0},{"$f":"AC8*'PV calculation'!AR$23","v":0},{"$f":"AD8*'PV calculation'!AS$23","v":0},{"$f":"AE8*'PV calculation'!AT$23","v":0},{"$f":"AF8*'PV calculation'!AU$23","v":0},{"$f":"AG8*'PV calculation'!AV$23","v":0},{"$f":"AH8*'PV calculation'!AW$23","v":0},{"$f":"AI8*'PV calculation'!AX$23","v":0}]
[null,4,{"$f":"IF('Product benefit & adoption'!D14=\"\",\"\",'Product benefit & adoption'!D14)","v":""},{"$f":"IF('Product benefit & adoption'!F14=\"\",\"\",'Product benefit & adoption'!F14)","v":""},{"$f":"_xlfn.IFS('Product benefit & adoption'!$G$4=\"ALL\",SUM(F60:AI60),'Product benefit & adoption'!$G$4=\"2020-25\",SUM(K60:AI60),'Product benefit & adoption'!$G$4=\"2015-20\",SUM(F60:AD60))","v":0},{"$f":"F9*'PV calculation'!U$23","v":0},{"$f":"G9*'PV calculation'!V$23","v":0},{"$f":"H9*'PV calculation'!W$23","v":0},{"$f":"I9*'PV calculation'!X$23","v":0},{"$f":"J9*'PV calculation'!Y$23","v":0},{"$f":"K9*'PV calculation'!Z$23","v":0},{"$f":"L9*'PV calculation'!AA$23","v":0},{"$f":"M9*'PV calculation'!AB$23","v":0},{"$f":"N9*'PV calculation'!AC$23","v":0},{"$f":"O9*'PV calculation'!AD$23","v":0},{"$f":"P9*'PV calculation'!AE$23","v":0},{"$f":"Q9*'PV calculation'!AF$23","v":0},{"$f":"R9*'PV calculation'!AG$23","v":0},{"$f":"S9*'PV calculation'!AH$23","v":0},{"$f":"T9*'PV calculation'!AI$23","v":0},{"$f":"U9*'PV calculation'!AJ$23","v":0},{"$f":"V9*'PV calculation'!AK$23","v":0},{"$f":"W9*'PV calculation'!AL$23","v":0},{"$f":"X9*'PV calculation'!AM$23","v":0},{"$f":"Y9*'PV calculation'!AN$23","v":0},{"$f":"Z9*'PV calculation'!AO$23","v":0},{"$f":"AA9*'PV calculation'!AP$23","v":0},{"$f":"AB9*'PV calculation'!AQ$23","v":0},{"$f":"AC9*'PV calculation'!AR$23","v":0},{"$f":"AD9*'PV calculation'!AS$23","v":0},{"$f":"AE9*'PV calculation'!AT$23","v":0},{"$f":"AF9*'PV calculation'!AU$23","v":0},{"$f":"AG9*'PV calculation'!AV$23","v":0},{"$f":"AH9*'PV calculation'!AW$23","v":0},{"$f":"AI9*'PV calculation'!AX$23","v":0}]
[null,5,{"$f":"IF('Product benefit & adoption'!D15=\"\",\"\",'Product benefit & adoption'!D15)","v":""},{"$f":"IF('Product benefit & adoption'!F15=\"\",\"\",'Product benefit & adoption'!F15)","v":""},{"$f":"_xlfn.IFS('Product benefit & adoption'!$G$4=\"ALL\",SUM(F61:AI61),'Product benefit & adoption'!$G$4=\"2020-25\",SUM(K61:AI61),'Product benefit & adoption'!$G$4=\"2015-20\",SUM(F61:AD61))","v":0},{"$f":"F10*'PV calculation'!U$23","v":0},{"$f":"G10*'PV calculation'!V$23","v":0},{"$f":"H10*'PV calculation'!W$23","v":0},{"$f":"I10*'PV calculation'!X$23","v":0},{"$f":"J10*'PV calculation'!Y$23","v":0},{"$f":"K10*'PV calculation'!Z$23","v":0},{"$f":"L10*'PV calculation'!AA$23","v":0},{"$f":"M10*'PV calculation'!AB$23","v":0},{"$f":"N10*'PV calculation'!AC$23","v":0},{"$f":"O10*'PV calculation'!AD$23","v":0},{"$f":"P10*'PV calculation'!AE$23","v":0},{"$f":"Q10*'PV calculation'!AF$23","v":0},{"$f":"R10*'PV calculation'!AG$23","v":0},{"$f":"S10*'PV calculation'!AH$23","v":0},{"$f":"T10*'PV calculation'!AI$23","v":0},{"$f":"U10*'PV calculation'!AJ$23","v":0},{"$f":"V10*'PV calculation'!AK$23","v":0},{"$f":"W10*'PV calculation'!AL$23","v":0},{"$f":"X10*'PV calculation'!AM$23","v":0},{"$f":"Y10*'PV calculation'!AN$23","v":0},{"$f":"Z10*'PV calculation'!AO$23","v":0},{"$f":"AA10*'PV calculation'!AP$23","v":0},{"$f":"AB10*'PV calculation'!AQ$23","v":0},{"$f":"AC10*'PV calculation'!AR$23","v":0},{"$f":"AD10*'PV calculation'!AS$23","v":0},{"$f":"AE10*'PV calculation'!AT$23","v":0},{"$f":"AF10*'PV calculation'!AU$23","v":0},{"$f":"AG10*'PV calculation'!AV$23","v":0},{"$f":"AH10*'PV calculation'!AW$23","v":0},{"$f":"AI10*'PV calculation'!AX$23","v":0}]
[null,6,{"$f":"IF('Product benefit & adoption'!D16=\"\",\"\",'Product benefit & adoption'!D16)","v":""},{"$f":"IF('Product benefit & adoption'!F16=\"\",\"\",'Product benefit & adoption'!F16)","v":""},{"$f":"_xlfn.IFS('Product benefit & adoption'!$G$4=\"ALL\",SUM(F62:AI62),'Product benefit & adoption'!$G$4=\"2020-25\",SUM(K62:AI62),'Product benefit & adoption'!$G$4=\"2015-20\",SUM(F62:AD62))","v":0},{"$f":"F11*'PV calculation'!U$23","v":0},{"$f":"G11*'PV calculation'!V$23","v":0},{"$f":"H11*'PV calculation'!W$23","v":0},{"$f":"I11*'PV calculation'!X$23","v":0},{"$f":"J11*'PV calculation'!Y$23","v":0},{"$f":"K11*'PV calculation'!Z$23","v":0},{"$f":"L11*'PV calculation'!AA$23","v":0},{"$f":"M11*'PV calculation'!AB$23","v":0},{"$f":"N11*'PV calculation'!AC$23","v":0},{"$f":"O11*'PV calculation'!AD$23","v":0},{"$f":"P11*'PV calculation'!AE$23","v":0},{"$f":"Q11*'PV calculation'!AF$23","v":0},{"$f":"R11*'PV calculation'!AG$23","v":0},{"$f":"S11*'PV calculation'!AH$23","v":0},{"$f":"T11*'PV calculation'!AI$23","v":0},{"$f":"U11*'PV calculation'!AJ$23","v":0},{"$f":"V11*'PV calculation'!AK$23","v":0},{"$f":"W11*'PV calculation'!AL$23","v":0},{"$f":"X11*'PV calculation'!AM$23","v":0},{"$f":"Y11*'PV calculation'!AN$23","v":0},{"$f":"Z11*'PV calculation'!AO$23","v":0},{"$f":"AA11*'PV calculation'!AP$23","v":0},{"$f":"AB11*'PV calculation'!AQ$23","v":0},{"$f":"AC11*'PV calculation'!AR$23","v":0},{"$f":"AD11*'PV calculation'!AS$23","v":0},{"$f":"AE11*'PV calculation'!AT$23","v":0},{"$f":"AF11*'PV calculation'!AU$23","v":0},{"$f":"AG11*'PV calculation'!AV$23","v":0},{"$f":"AH11*'PV calculation'!AW$23","v":0},{"$f":"AI11*'PV calculation'!AX$23","v":0}]
[null,7,{"$f":"IF('Product benefit & adoption'!D17=\"\",\"\",'Product benefit & adoption'!D17)","v":""},{"$f":"IF('Product benefit & adoption'!F17=\"\",\"\",'Product benefit & adoption'!F17)","v":""},{"$f":"_xlfn.IFS('Product benefit & adoption'!$G$4=\"ALL\",SUM(F63:AI63),'Product benefit & adoption'!$G$4=\"2020-25\",SUM(K63:AI63),'Product benefit & adoption'!$G$4=\"2015-20\",SUM(F63:AD63))","v":0},{"$f":"F12*'PV calculation'!U$23","v":0},{"$f":"G12*'PV calculation'!V$23","v":0},{"$f":"H12*'PV calculation'!W$23","v":0},{"$f":"I12*'PV calculation'!X$23","v":0},{"$f":"J12*'PV calculation'!Y$23","v":0},{"$f":"K12*'PV calculation'!Z$23","v":0},{"$f":"L12*'PV calculation'!AA$23","v":0},{"$f":"M12*'PV calculation'!AB$23","v":0},{"$f":"N12*'PV calculation'!AC$23","v":0},{"$f":"O12*'PV calculation'!AD$23","v":0},{"$f":"P12*'PV calculation'!AE$23","v":0},{"$f":"Q12*'PV calculation'!AF$23","v":0},{"$f":"R12*'PV calculation'!AG$23","v":0},{"$f":"S12*'PV calculation'!AH$23","v":0},{"$f":"T12*'PV calculation'!AI$23","v":0},{"$f":"U12*'PV calculation'!AJ$23","v":0},{"$f":"V12*'PV calculation'!AK$23","v":0},{"$f":"W12*'PV calculation'!AL$23","v":0},{"$f":"X12*'PV calculation'!AM$23","v":0},{"$f":"Y12*'PV calculation'!AN$23","v":0},{"$f":"Z12*'PV calculation'!AO$23","v":0},{"$f":"AA12*'PV calculation'!AP$23","v":0},{"$f":"AB12*'PV calculation'!AQ$23","v":0},{"$f":"AC12*'PV calculation'!AR$23","v":0},{"$f":"AD12*'PV calculation'!AS$23","v":0},{"$f":"AE12*'PV calculation'!AT$23","v":0},{"$f":"AF12*'PV calculation'!AU$23","v":0},{"$f":"AG12*'PV calculation'!AV$23","v":0},{"$f":"AH12*'PV calculation'!AW$23","v":0},{"$f":"AI12*'PV calculation'!AX$23","v":0}]
[null,8,{"$f":"IF('Product benefit & adoption'!D18=\"\",\"\",'Product benefit & adoption'!D18)","v":""},{"$f":"IF('Product benefit & adoption'!F18=\"\",\"\",'Product benefit & adoption'!F18)","v":""},{"$f":"_xlfn.IFS('Product benefit & adoption'!$G$4=\"ALL\",SUM(F64:AI64),'Product benefit & adoption'!$G$4=\"2020-25\",SUM(K64:AI64),'Product benefit & adoption'!$G$4=\"2015-20\",SUM(F64:AD64))","v":0},{"$f":"F13*'PV calculation'!U$23","v":0},{"$f":"G13*'PV calculation'!V$23","v":0},{"$f":"H13*'PV calculation'!W$23","v":0},{"$f":"I13*'PV calculation'!X$23","v":0},{"$f":"J13*'PV calculation'!Y$23","v":0},{"$f":"K13*'PV calculation'!Z$23","v":0},{"$f":"L13*'PV calculation'!AA$23","v":0},{"$f":"M13*'PV calculation'!AB$23","v":0},{"$f":"N13*'PV calculation'!AC$23","v":0},{"$f":"O13*'PV calculation'!AD$23","v":0},{"$f":"P13*'PV calculation'!AE$23","v":0},{"$f":"Q13*'PV calculation'!AF$23","v":0},{"$f":"R13*'PV calculation'!AG$23","v":0},{"$f":"S13*'PV calculation'!AH$23","v":0},{"$f":"T13*'PV calculation'!AI$23","v":0},{"$f":"U13*'PV calculation'!AJ$23","v":0},{"$f":"V13*'PV calculation'!AK$23","v":0},{"$f":"W13*'PV calculation'!AL$23","v":0},{"$f":"X13*'PV calculation'!AM$23","v":0},{"$f":"Y13*'PV calculation'!AN$23","v":0},{"$f":"Z13*'PV calculation'!AO$23","v":0},{"$f":"AA13*'PV calculation'!AP$23","v":0},{"$f":"AB13*'PV calculation'!AQ$23","v":0},{"$f":"AC13*'PV calculation'!AR$23","v":0},{"$f":"AD13*'PV calculation'!AS$23","v":0},{"$f":"AE13*'PV calculation'!AT$23","v":0},{"$f":"AF13*'PV calculation'!AU$23","v":0},{"$f":"AG13*'PV calculation'!AV$23","v":0},{"$f":"AH13*'PV calculation'!AW$23","v":0},{"$f":"AI13*'PV calculation'!AX$23","v":0}]
[null,9,{"$f":"IF('Product benefit & adoption'!D19=\"\",\"\",'Product benefit & adoption'!D19)","v":""},{"$f":"IF('Product benefit & adoption'!F19=\"\",\"\",'Product benefit & adoption'!F19)","v":""},{"$f":"_xlfn.IFS('Product benefit & adoption'!$G$4=\"ALL\",SUM(F65:AI65),'Product benefit & adoption'!$G$4=\"2020-25\",SUM(K65:AI65),'Product benefit & adoption'!$G$4=\"2015-20\",SUM(F65:AD65))","v":0},{"$f":"F14*'PV calculation'!U$23","v":0},{"$f":"G14*'PV calculation'!V$23","v":0},{"$f":"H14*'PV calculation'!W$23","v":0},{"$f":"I14*'PV calculation'!X$23","v":0},{"$f":"J14*'PV calculation'!Y$23","v":0},{"$f":"K14*'PV calculation'!Z$23","v":0},{"$f":"L14*'PV calculation'!AA$23","v":0},{"$f":"M14*'PV calculation'!AB$23","v":0},{"$f":"N14*'PV calculation'!AC$23","v":0},{"$f":"O14*'PV calculation'!AD$23","v":0},{"$f":"P14*'PV calculation'!AE$23","v":0},{"$f":"Q14*'PV calculation'!AF$23","v":0},{"$f":"R14*'PV calculation'!AG$23","v":0},{"$f":"S14*'PV calculation'!AH$23","v":0},{"$f":"T14*'PV calculation'!AI$23","v":0},{"$f":"U14*'PV calculation'!AJ$23","v":0},{"$f":"V14*'PV calculation'!AK$23","v":0},{"$f":"W14*'PV calculation'!AL$23","v":0},{"$f":"X14*'PV calculation'!AM$23","v":0},{"$f":"Y14*'PV calculation'!AN$23","v":0},{"$f":"Z14*'PV calculation'!AO$23","v":0},{"$f":"AA14*'PV calculation'!AP$23","v":0},{"$f":"AB14*'PV calculation'!AQ$23","v":0},{"$f":"AC14*'PV calculation'!AR$23","v":0},{"$f":"AD14*'PV calculation'!AS$23","v":0},{"$f":"AE14*'PV calculation'!AT$23","v":0},{"$f":"AF14*'PV calculation'!AU$23","v":0},{"$f":"AG14*'PV calculation'!AV$23","v":0},{"$f":"AH14*'PV calculation'!AW$23","v":0},{"$f":"AI14*'PV calculation'!AX$23","v":0}]
[null,10,{"$f":"IF('Product benefit & adoption'!D20=\"\",\"\",'Product benefit & adoption'!D20)","v":""},{"$f":"IF('Product benefit & adoption'!F20=\"\",\"\",'Product benefit & adoption'!F20)","v":""},{"$f":"_xlfn.IFS('Product benefit & adoption'!$G$4=\"ALL\",SUM(F66:AI66),'Product benefit & adoption'!$G$4=\"2020-25\",SUM(K66:AI66),'Product benefit & adoption'!$G$4=\"2015-20\",SUM(F66:AD66))","v":0},{"$f":"F15*'PV calculation'!U$23","v":0},{"$f":"G15*'PV calculation'!V$23","v":0},{"$f":"H15*'PV calculation'!W$23","v":0},{"$f":"I15*'PV calculation'!X$23","v":0},{"$f":"J15*'PV calculation'!Y$23","v":0},{"$f":"K15*'PV calculation'!Z$23","v":0},{"$f":"L15*'PV calculation'!AA$23","v":0},{"$f":"M15*'PV calculation'!AB$23","v":0},{"$f":"N15*'PV calculation'!AC$23","v":0},{"$f":"O15*'PV calculation'!AD$23","v":0},{"$f":"P15*'PV calculation'!AE$23","v":0},{"$f":"Q15*'PV calculation'!AF$23","v":0},{"$f":"R15*'PV calculation'!AG$23","v":0},{"$f":"S15*'PV calculation'!AH$23","v":0},{"$f":"T15*'PV calculation'!AI$23","v":0},{"$f":"U15*'PV calculation'!AJ$23","v":0},{"$f":"V15*'PV calculation'!AK$23","v":0},{"$f":"W15*'PV calculation'!AL$23","v":0},{"$f":"X15*'PV calculation'!AM$23","v":0},{"$f":"Y15*'PV calculation'!AN$23","v":0},{"$f":"Z15*'PV calculation'!AO$23","v":0},{"$f":"AA15*'PV calculation'!AP$23","v":0},{"$f":"AB15*'PV calculation'!AQ$23","v":0},{"$f":"AC15*'PV calculation'!AR$23","v":0},{"$f":"AD15*'PV calculation'!AS$23","v":0},{"$f":"AE15*'PV calculation'!AT$23","v":0},{"$f":"AF15*'PV calculation'!AU$23","v":0},{"$f":"AG15*'PV calculation'!AV$23","v":0},{"$f":"AH15*'PV calculation'!AW$23","v":0},{"$f":"AI15*'PV calculation'!AX$23","v":0}]
[null,11,{"$f":"IF('Product benefit & adoption'!D21=\"\",\"\",'Product benefit & adoption'!D21)","v":""},{"$f":"IF('Product benefit & adoption'!F21=\"\",\"\",'Product benefit & adoption'!F21)","v":""},{"$f":"_xlfn.IFS('Product benefit & adoption'!$G$4=\"ALL\",SUM(F67:AI67),'Product benefit & adoption'!$G$4=\"2020-25\",SUM(K67:AI67),'Product benefit & adoption'!$G$4=\"2015-20\",SUM(F67:AD67))","v":0},{"$f":"F16*'PV calculation'!U$23","v":0},{"$f":"G16*'PV calculation'!V$23","v":0},{"$f":"H16*'PV calculation'!W$23","v":0},{"$f":"I16*'PV calculation'!X$23","v":0},{"$f":"J16*'PV calculation'!Y$23","v":0},{"$f":"K16*'PV calculation'!Z$23","v":0},{"$f":"L16*'PV calculation'!AA$23","v":0},{"$f":"M16*'PV calculation'!AB$23","v":0},{"$f":"N16*'PV calculation'!AC$23","v":0},{"$f":"O16*'PV calculation'!AD$23","v":0},{"$f":"P16*'PV calculation'!AE$23","v":0},{"$f":"Q16*'PV calculation'!AF$23","v":0},{"$f":"R16*'PV calculation'!AG$23","v":0},{"$f":"S16*'PV calculation'!AH$23","v":0},{"$f":"T16*'PV calculation'!AI$23","v":0},{"$f":"U16*'PV calculation'!AJ$23","v":0},{"$f":"V16*'PV calculation'!AK$23","v":0},{"$f":"W16*'PV calculation'!AL$23","v":0},{"$f":"X16*'PV calculation'!AM$23","v":0},{"$f":"Y16*'PV calculation'!AN$23","v":0},{"$f":"Z16*'PV calculation'!AO$23","v":0},{"$f":"AA16*'PV calculation'!AP$23","v":0},{"$f":"AB16*'PV calculation'!AQ$23","v":0},{"$f":"AC16*'PV calculation'!AR$23","v":0},{"$f":"AD16*'PV calculation'!AS$23","v":0},{"$f":"AE16*'PV calculation'!AT$23","v":0},{"$f":"AF16*'PV calculation'!AU$23","v":0},{"$f":"AG16*'PV calculation'!AV$23","v":0},{"$f":"AH16*'PV calculation'!AW$23","v":0},{"$f":"AI16*'PV calculation'!AX$23","v":0}]
[null,12,{"$f":"IF('Product benefit & adoption'!D22=\"\",\"\",'Product benefit & adoption'!D22)","v":""},{"$f":"IF('Product benefit & adoption'!F22=\"\",\"\",'Product benefit & adoption'!F22)","v":""},{"$f":"_xlfn.IFS('Product benefit & adoption'!$G$4=\"ALL\",SUM(F68:AI68),'Product benefit & adoption'!$G$4=\"2020-25\",SUM(K68:AI68),'Product benefit & adoption'!$G$4=\"2015-20\",SUM(F68:AD68))","v":0},{"$f":"F17*'PV calculation'!U$23","v":0},{"$f":"G17*'PV calculation'!V$23","v":0},{"$f":"H17*'PV calculation'!W$23","v":0},{"$f":"I17*'PV calculation'!X$23","v":0},{"$f":"J17*'PV calculation'!Y$23","v":0},{"$f":"K17*'PV calculation'!Z$23","v":0},{"$f":"L17*'PV calculation'!AA$23","v":0},{"$f":"M17*'PV calculation'!AB$23","v":0},{"$f":"N17*'PV calculation'!AC$23","v":0},{"$f":"O17*'PV calculation'!AD$23","v":0},{"$f":"P17*'PV calculation'!AE$23","v":0},{"$f":"Q17*'PV calculation'!AF$23","v":0},{"$f":"R17*'PV calculation'!AG$23","v":0},{"$f":"S17*'PV calculation'!AH$23","v":0},{"$f":"T17*'PV calculation'!AI$23","v":0},{"$f":"U17*'PV calculation'!AJ$23","v":0},{"$f":"V17*'PV calculation'!AK$23","v":0},{"$f":"W17*'PV calculation'!AL$23","v":0},{"$f":"X17*'PV calculation'!AM$23","v":0},{"$f":"Y17*'PV calculation'!AN$23","v":0},{"$f":"Z17*'PV calculation'!AO$23","v":0},{"$f":"AA17*'PV calculation'!AP$23","v":0},{"$f":"AB17*'PV calculation'!AQ$23","v":0},{"$f":"AC17*'PV calculation'!AR$23","v":0},{"$f":"AD17*'PV calculation'!AS$23","v":0},{"$f":"AE17*'PV calculation'!AT$23","v":0},{"$f":"AF17*'PV calculation'!AU$23","v":0},{"$f":"AG17*'PV calculation'!AV$23","v":0},{"$f":"AH17*'PV calculation'!AW$23","v":0},{"$f":"AI17*'PV calculation'!AX$23","v":0}]
[null,13,{"$f":"IF('Product benefit & adoption'!D23=\"\",\"\",'Product benefit & adoption'!D23)","v":""},{"$f":"IF('Product benefit & adoption'!F23=\"\",\"\",'Product benefit & adoption'!F23)","v":""},{"$f":"_xlfn.IFS('Product benefit & adoption'!$G$4=\"ALL\",SUM(F69:AI69),'Product benefit & adoption'!$G$4=\"2020-25\",SUM(K69:AI69),'Product benefit & adoption'!$G$4=\"2015-20\",SUM(F69:AD69))","v":0},{"$f":"F18*'PV calculation'!U$23","v":0},{"$f":"G18*'PV calculation'!V$23","v":0},{"$f":"H18*'PV calculation'!W$23","v":0},{"$f":"I18*'PV calculation'!X$23","v":0},{"$f":"J18*'PV calculation'!Y$23","v":0},{"$f":"K18*'PV calculation'!Z$23","v":0},{"$f":"L18*'PV calculation'!AA$23","v":0},{"$f":"M18*'PV calculation'!AB$23","v":0},{"$f":"N18*'PV calculation'!AC$23","v":0},{"$f":"O18*'PV calculation'!AD$23","v":0},{"$f":"P18*'PV calculation'!AE$23","v":0},{"$f":"Q18*'PV calculation'!AF$23","v":0},{"$f":"R18*'PV calculation'!AG$23","v":0},{"$f":"S18*'PV calculation'!AH$23","v":0},{"$f":"T18*'PV calculation'!AI$23","v":0},{"$f":"U18*'PV calculation'!AJ$23","v":0},{"$f":"V18*'PV calculation'!AK$23","v":0},{"$f":"W18*'PV calculation'!AL$23","v":0},{"$f":"X18*'PV calculation'!AM$23","v":0},{"$f":"Y18*'PV calculation'!AN$23","v":0},{"$f":"Z18*'PV calculation'!AO$23","v":0},{"$f":"AA18*'PV calculation'!AP$23","v":0},{"$f":"AB18*'PV calculation'!AQ$23","v":0},{"$f":"AC18*'PV calculation'!AR$23","v":0},{"$f":"AD18*'PV calculation'!AS$23","v":0},{"$f":"AE18*'PV calculation'!AT$23","v":0},{"$f":"AF18*'PV calculation'!AU$23","v":0},{"$f":"AG18*'PV calculation'!AV$23","v":0},{"$f":"AH18*'PV calculation'!AW$23","v":0},{"$f":"AI18*'PV calculation'!AX$23","v":0}]
[null,14,{"$f":"IF('Product benefit & adoption'!D24=\"\",\"\",'Product benefit & adoption'!D24)","v":""},{"$f":"IF('Product benefit & adoption'!F24=\"\",\"\",'Product benefit & adoption'!F24)","v":""},{"$f":"_xlfn.IFS('Product benefit & adoption'!$G$4=\"ALL\",SUM(F70:AI70),'Product benefit & adoption'!$G$4=\"2020-25\",SUM(K70:AI70),'Product benefit & adoption'!$G$4=\"2015-20\",SUM(F70:AD70))","v":0},{"$f":"F19*'PV calculation'!U$23","v":0},{"$f":"G19*'PV calculation'!V$23","v":0},{"$f":"H19*'PV calculation'!W$23","v":0},{"$f":"I19*'PV calculation'!X$23","v":0},{"$f":"J19*'PV calculation'!Y$23","v":0},{"$f":"K19*'PV calculation'!Z$23","v":0},{"$f":"L19*'PV calculation'!AA$23","v":0},{"$f":"M19*'PV calculation'!AB$23","v":0},{"$f":"N19*'PV calculation'!AC$23","v":0},{"$f":"O19*'PV calculation'!AD$23","v":0},{"$f":"P19*'PV calculation'!AE$23","v":0},{"$f":"Q19*'PV calculation'!AF$23","v":0},{"$f":"R19*'PV calculation'!AG$23","v":0},{"$f":"S19*'PV calculation'!AH$23","v":0},{"$f":"T19*'PV calculation'!AI$23","v":0},{"$f":"U19*'PV calculation'!AJ$23","v":0},{"$f":"V19*'PV calculation'!AK$23","v":0},{"$f":"W19*'PV calculation'!AL$23","v":0},{"$f":"X19*'PV calculation'!AM$23","v":0},{"$f":"Y19*'PV calculation'!AN$23","v":0},{"$f":"Z19*'PV calculation'!AO$23","v":0},{"$f":"AA19*'PV calculation'!AP$23","v":0},{"$f":"AB19*'PV calculation'!AQ$23","v":0},{"$f":"AC19*'PV calculation'!AR$23","v":0},{"$f":"AD19*'PV calculation'!AS$23","v":0},{"$f":"AE19*'PV calculation'!AT$23","v":0},{"$f":"AF19*'PV calculation'!AU$23","v":0},{"$f":"AG19*'PV calculation'!AV$23","v":0},{"$f":"AH19*'PV calculation'!AW$23","v":0},{"$f":"AI19*'PV calculation'!AX$23","v":0}]
[null,15,{"$f":"IF('Product benefit & adoption'!D25=\"\",\"\",'Product benefit & adoption'!D25)","v":""},{"$f":"IF('Product benefit & adoption'!F25=\"\",\"\",'Product benefit & adoption'!F25)","v":""},{"$f":"_xlfn.IFS('Product benefit & adoption'!$G$4=\"ALL\",SUM(F71:AI71),'Product benefit & adoption'!$G$4=\"2020-25\",SUM(K71:AI71),'Product benefit & adoption'!$G$4=\"2015-20\",SUM(F71:AD71))","v":0},{"$f":"F20*'PV calculation'!U$23","v":0},{"$f":"G20*'PV calculation'!V$23","v":0},{"$f":"H20*'PV calculation'!W$23","v":0},{"$f":"I20*'PV calculation'!X$23","v":0},{"$f":"J20*'PV calculation'!Y$23","v":0},{"$f":"K20*'PV calculation'!Z$23","v":0},{"$f":"L20*'PV calculation'!AA$23","v":0},{"$f":"M20*'PV calculation'!AB$23","v":0},{"$f":"N20*'PV calculation'!AC$23","v":0},{"$f":"O20*'PV calculation'!AD$23","v":0},{"$f":"P20*'PV calculation'!AE$23","v":0},{"$f":"Q20*'PV calculation'!AF$23","v":0},{"$f":"R20*'PV calculation'!AG$23","v":0},{"$f":"S20*'PV calculation'!AH$23","v":0},{"$f":"T20*'PV calculation'!AI$23","v":0},{"$f":"U20*'PV calculation'!AJ$23","v":0},{"$f":"V20*'PV calculation'!AK$23","v":0},{"$f":"W20*'PV calculation'!AL$23","v":0},{"$f":"X20*'PV calculation'!AM$23","v":0},{"$f":"Y20*'PV calculation'!AN$23","v":0},{"$f":"Z20*'PV calculation'!AO$23","v":0},{"$f":"AA20*'PV calculation'!AP$23","v":0},{"$f":"AB20*'PV calculation'!AQ$23","v":0},{"$f":"AC20*'PV calculation'!AR$23","v":0},{"$f":"AD20*'PV calculation'!AS$23","v":0},{"$f":"AE20*'PV calculation'!AT$23","v":0},{"$f":"AF20*'PV calculation'!AU$23","v":0},{"$f":"AG20*'PV calculation'!AV$23","v":0},{"$f":"AH20*'PV calculation'!AW$23","v":0},{"$f":"AI20*'PV calculation'!AX$23","v":0}]
[null,16,{"$f":"IF('Product benefit & adoption'!D26=\"\",\"\",'Product benefit & adoption'!D26)","v":""},{"$f":"IF('Product benefit & adoption'!F26=\"\",\"\",'Product benefit & adoption'!F26)","v":""},{"$f":"_xlfn.IFS('Product benefit & adoption'!$G$4=\"ALL\",SUM(F72:AI72),'Product benefit & adoption'!$G$4=\"2020-25\",SUM(K72:AI72),'Product benefit & adoption'!$G$4=\"2015-20\",SUM(F72:AD72))","v":0},{"$f":"F21*'PV calculation'!U$23","v":0},{"$f":"G21*'PV calculation'!V$23","v":0},{"$f":"H21*'PV calculation'!W$23","v":0},{"$f":"I21*'PV calculation'!X$23","v":0},{"$f":"J21*'PV calculation'!Y$23","v":0},{"$f":"K21*'PV calculation'!Z$23","v":0},{"$f":"L21*'PV calculation'!AA$23","v":0},{"$f":"M21*'PV calculation'!AB$23","v":0},{"$f":"N21*'PV calculation'!AC$23","v":0},{"$f":"O21*'PV calculation'!AD$23","v":0},{"$f":"P21*'PV calculation'!AE$23","v":0},{"$f":"Q21*'PV calculation'!AF$23","v":0},{"$f":"R21*'PV calculation'!AG$23","v":0},{"$f":"S21*'PV calculation'!AH$23","v":0},{"$f":"T21*'PV calculation'!AI$23","v":0},{"$f":"U21*'PV calculation'!AJ$23","v":0},{"$f":"V21*'PV calculation'!AK$23","v":0},{"$f":"W21*'PV calculation'!AL$23","v":0},{"$f":"X21*'PV calculation'!AM$23","v":0},{"$f":"Y21*'PV calculation'!AN$23","v":0},{"$f":"Z21*'PV calculation'!AO$23","v":0},{"$f":"AA21*'PV calculation'!AP$23","v":0},{"$f":"AB21*'PV calculation'!AQ$23","v":0},{"$f":"AC21*'PV calculation'!AR$23","v":0},{"$f":"AD21*'PV calculation'!AS$23","v":0},{"$f":"AE21*'PV calculation'!AT$23","v":0},{"$f":"AF21*'PV calculation'!AU$23","v":0},{"$f":"AG21*'PV calculation'!AV$23","v":0},{"$f":"AH21*'PV calculation'!AW$23","v":0},{"$f":"AI21*'PV calculation'!AX$23","v":0}]
[null,17,{"$f":"IF('Product benefit & adoption'!D27=\"\",\"\",'Product benefit & adoption'!D27)","v":""},{"$f":"IF('Product benefit & adoption'!F27=\"\",\"\",'Product benefit & adoption'!F27)","v":""},{"$f":"_xlfn.IFS('Product benefit & adoption'!$G$4=\"ALL\",SUM(F73:AI73),'Product benefit & adoption'!$G$4=\"2020-25\",SUM(K73:AI73),'Product benefit & adoption'!$G$4=\"2015-20\",SUM(F73:AD73))","v":0},{"$f":"F22*'PV calculation'!U$23","v":0},{"$f":"G22*'PV calculation'!V$23","v":0},{"$f":"H22*'PV calculation'!W$23","v":0},{"$f":"I22*'PV calculation'!X$23","v":0},{"$f":"J22*'PV calculation'!Y$23","v":0},{"$f":"K22*'PV calculation'!Z$23","v":0},{"$f":"L22*'PV calculation'!AA$23","v":0},{"$f":"M22*'PV calculation'!AB$23","v":0},{"$f":"N22*'PV calculation'!AC$23","v":0},{"$f":"O22*'PV calculation'!AD$23","v":0},{"$f":"P22*'PV calculation'!AE$23","v":0},{"$f":"Q22*'PV calculation'!AF$23","v":0},{"$f":"R22*'PV calculation'!AG$23","v":0},{"$f":"S22*'PV calculation'!AH$23","v":0},{"$f":"T22*'PV calculation'!AI$23","v":0},{"$f":"U22*'PV calculation'!AJ$23","v":0},{"$f":"V22*'PV calculation'!AK$23","v":0},{"$f":"W22*'PV calculation'!AL$23","v":0},{"$f":"X22*'PV calculation'!AM$23","v":0},{"$f":"Y22*'PV calculation'!AN$23","v":0},{"$f":"Z22*'PV calculation'!AO$23","v":0},{"$f":"AA22*'PV calculation'!AP$23","v":0},{"$f":"AB22*'PV calculation'!AQ$23","v":0},{"$f":"AC22*'PV calculation'!AR$23","v":0},{"$f":"AD22*'PV calculation'!AS$23","v":0},{"$f":"AE22*'PV calculation'!AT$23","v":0},{"$f":"AF22*'PV calculation'!AU$23","v":0},{"$f":"AG22*'PV calculation'!AV$23","v":0},{"$f":"AH22*'PV calculation'!AW$23","v":0},{"$f":"AI22*'PV calculation'!AX$23","v":0}]
[null,18,{"$f":"IF('Product benefit & adoption'!D28=\"\",\"\",'Product benefit & adoption'!D28)","v":""},{"$f":"IF('Product benefit & adoption'!F28=\"\",\"\",'Product benefit & adoption'!F28)","v":""},{"$f":"_xlfn.IFS('Product benefit & adoption'!$G$4=\"ALL\",SUM(F74:AI74),'Product benefit & adoption'!$G$4=\"2020-25\",SUM(K74:AI74),'Product benefit & adoption'!$G$4=\"2015-20\",SUM(F74:AD74))","v":0},{"$f":"F23*'PV calculation'!U$23","v":0},{"$f":"G23*'PV calculation'!V$23","v":0},{"$f":"H23*'PV calculation'!W$23","v":0},{"$f":"I23*'PV calculation'!X$23","v":0},{"$f":"J23*'PV calculation'!Y$23","v":0},{"$f":"K23*'PV calculation'!Z$23","v":0},{"$f":"L23*'PV calculation'!AA$23","v":0},{"$f":"M23*'PV calculation'!AB$23","v":0},{"$f":"N23*'PV calculation'!AC$23","v":0},{"$f":"O23*'PV calculation'!AD$23","v":0},{"$f":"P23*'PV calculation'!AE$23","v":0},{"$f":"Q23*'PV calculation'!AF$23","v":0},{"$f":"R23*'PV calculation'!AG$23","v":0},{"$f":"S23*'PV calculation'!AH$23","v":0},{"$f":"T23*'PV calculation'!AI$23","v":0},{"$f":"U23*'PV calculation'!AJ$23","v":0},{"$f":"V23*'PV calculation'!AK$23","v":0},{"$f":"W23*'PV calculation'!AL$23","v":0},{"$f":"X23*'PV calculation'!AM$23","v":0},{"$f":"Y23*'PV calculation'!AN$23","v":0},{"$f":"Z23*'PV calculation'!AO$23","v":0},{"$f":"AA23*'PV calculation'!AP$23","v":0},{"$f":"AB23*'PV calculation'!AQ$23","v":0},{"$f":"AC23*'PV calculation'!AR$23","v":0},{"$f":"AD23*'PV calculation'!AS$23","v":0},{"$f":"AE23*'PV calculation'!AT$23","v":0},{"$f":"AF23*'PV calculation'!AU$23","v":0},{"$f":"AG23*'PV calculation'!AV$23","v":0},{"$f":"AH23*'PV calculation'!AW$23","v":0},{"$f":"AI23*'PV calculation'!AX$23","v":0}]
[null,19,{"$f":"IF('Product benefit & adoption'!D29=\"\",\"\",'Product benefit & adoption'!D29)","v":""},{"$f":"IF('Product benefit & adoption'!F29=\"\",\"\",'Product benefit & adoption'!F29)","v":""},{"$f":"_xlfn.IFS('Product benefit & adoption'!$G$4=\"ALL\",SUM(F75:AI75),'Product benefit & adoption'!$G$4=\"2020-25\",SUM(K75:AI75),'Product benefit & adoption'!$G$4=\"2015-20\",SUM(F75:AD75))","v":0},{"$f":"F24*'PV calculation'!U$23","v":0},{"$f":"G24*'PV calculation'!V$23","v":0},{"$f":"H24*'PV calculation'!W$23","v":0},{"$f":"I24*'PV calculation'!X$23","v":0},{"$f":"J24*'PV calculation'!Y$23","v":0},{"$f":"K24*'PV calculation'!Z$23","v":0},{"$f":"L24*'PV calculation'!AA$23","v":0},{"$f":"M24*'PV calculation'!AB$23","v":0},{"$f":"N24*'PV calculation'!AC$23","v":0},{"$f":"O24*'PV calculation'!AD$23","v":0},{"$f":"P24*'PV calculation'!AE$23","v":0},{"$f":"Q24*'PV calculation'!AF$23","v":0},{"$f":"R24*'PV calculation'!AG$23","v":0},{"$f":"S24*'PV calculation'!AH$23","v":0},{"$f":"T24*'PV calculation'!AI$23","v":0},{"$f":"U24*'PV calculation'!AJ$23","v":0},{"$f":"V24*'PV calculation'!AK$23","v":0},{"$f":"W24*'PV calculation'!AL$23","v":0},{"$f":"X24*'PV calculation'!AM$23","v":0},{"$f":"Y24*'PV calculation'!AN$23","v":0},{"$f":"Z24*'PV calculation'!AO$23","v":0},{"$f":"AA24*'PV calculation'!AP$23","v":0},{"$f":"AB24*'PV calculation'!AQ$23","v":0},{"$f":"AC24*'PV calculation'!AR$23","v":0},{"$f":"AD24*'PV calculation'!AS$23","v":0},{"$f":"AE24*'PV calculation'!AT$23","v":0},{"$f":"AF24*'PV calculation'!AU$23","v":0},{"$f":"AG24*'PV calculation'!AV$23","v":0},{"$f":"AH24*'PV calculation'!AW$23","v":0},{"$f":"AI24*'PV calculation'!AX$23","v":0}]
[null,20,{"$f":"IF('Product benefit & adoption'!D30=\"\",\"\",'Product benefit & adoption'!D30)","v":""},{"$f":"IF('Product benefit & adoption'!F30=\"\",\"\",'Product benefit & adoption'!F30)","v":""},{"$f":"_xlfn.IFS('Product benefit & adoption'!$G$4=\"ALL\",SUM(F76:AI76),'Product benefit & adoption'!$G$4=\"2020-25\",SUM(K76:AI76),'Product benefit & adoption'!$G$4=\"2015-20\",SUM(F76:AD76))","v":0},{"$f":"F25*'PV calculation'!U$23","v":0},{"$f":"G25*'PV calculation'!V$23","v":0},{"$f":"H25*'PV calculation'!W$23","v":0},{"$f":"I25*'PV calculation'!X$23","v":0},{"$f":"J25*'PV calculation'!Y$23","v":0},{"$f":"K25*'PV calculation'!Z$23","v":0},{"$f":"L25*'PV calculation'!AA$23","v":0},{"$f":"M25*'PV calculation'!AB$23","v":0},{"$f":"N25*'PV calculation'!AC$23","v":0},{"$f":"O25*'PV calculation'!AD$23","v":0},{"$f":"P25*'PV calculation'!AE$23","v":0},{"$f":"Q25*'PV calculation'!AF$23","v":0},{"$f":"R25*'PV calculation'!AG$23","v":0},{"$f":"S25*'PV calculation'!AH$23","v":0},{"$f":"T25*'PV calculation'!AI$23","v":0},{"$f":"U25*'PV calculation'!AJ$23","v":0},{"$f":"V25*'PV calculation'!AK$23","v":0},{"$f":"W25*'PV calculation'!AL$23","v":0},{"$f":"X25*'PV calculation'!AM$23","v":0},{"$f":"Y25*'PV calculation'!AN$23","v":0},{"$f":"Z25*'PV calculation'!AO$23","v":0},{"$f":"AA25*'PV calculation'!AP$23","v":0},{"$f":"AB25*'PV calculation'!AQ$23","v":0},{"$f":"AC25*'PV calculation'!AR$23","v":0},{"$f":"AD25*'PV calculation'!AS$23","v":0},{"$f":"AE25*'PV calculation'!AT$23","v":0},{"$f":"AF25*'PV calculation'!AU$23","v":0},{"$f":"AG25*'PV calculation'!AV$23","v":0},{"$f":"AH25*'PV calculation'!AW$23","v":0},{"$f":"AI25*'PV calculation'!AX$23","v":0}]
[null,21,{"$f":"IF('Product benefit & adoption'!D31=\"\",\"\",'Product benefit & adoption'!D31)","v":""},{"$f":"IF('Product benefit & adoption'!F31=\"\",\"\",'Product benefit & adoption'!F31)","v":""},{"$f":"_xlfn.IFS('Product benefit & adoption'!$G$4=\"ALL\",SUM(F77:AI77),'Product benefit & adoption'!$G$4=\"2020-25\",SUM(K77:AI77),'Product benefit & adoption'!$G$4=\"2015-20\",SUM(F77:AD77))","v":0},{"$f":"F26*'PV calculation'!U$23","v":0},{"$f":"G26*'PV calculation'!V$23","v":0},{"$f":"H26*'PV calculation'!W$23","v":0},{"$f":"I26*'PV calculation'!X$23","v":0},{"$f":"J26*'PV calculation'!Y$23","v":0},{"$f":"K26*'PV calculation'!Z$23","v":0},{"$f":"L26*'PV calculation'!AA$23","v":0},{"$f":"M26*'PV calculation'!AB$23","v":0},{"$f":"N26*'PV calculation'!AC$23","v":0},{"$f":"O26*'PV calculation'!AD$23","v":0},{"$f":"P26*'PV calculation'!AE$23","v":0},{"$f":"Q26*'PV calculation'!AF$23","v":0},{"$f":"R26*'PV calculation'!AG$23","v":0},{"$f":"S26*'PV calculation'!AH$23","v":0},{"$f":"T26*'PV calculation'!AI$23","v":0},{"$f":"U26*'PV calculation'!AJ$23","v":0},{"$f":"V26*'PV calculation'!AK$23","v":0},{"$f":"W26*'PV calculation'!AL$23","v":0},{"$f":"X26*'PV calculation'!AM$23","v":0},{"$f":"Y26*'PV calculation'!AN$23","v":0},{"$f":"Z26*'PV calculation'!AO$23","v":0},{"$f":"AA26*'PV calculation'!AP$23","v":0},{"$f":"AB26*'PV calculation'!AQ$23","v":0},{"$f":"AC26*'PV calculation'!AR$23","v":0},{"$f":"AD26*'PV calculation'!AS$23","v":0},{"$f":"AE26*'PV calculation'!AT$23","v":0},{"$f":"AF26*'PV calculation'!AU$23","v":0},{"$f":"AG26*'PV calculation'!AV$23","v":0},{"$f":"AH26*'PV calculation'!AW$23","v":0},{"$f":"AI26*'PV calculation'!AX$23","v":0}]
[null,22,{"$f":"IF('Product benefit & adoption'!D32=\"\",\"\",'Product benefit & adoption'!D32)","v":""},{"$f":"IF('Product benefit & adoption'!F32=\"\",\"\",'Product benefit & adoption'!F32)","v":""},{"$f":"_xlfn.IFS('Product benefit & adoption'!$G$4=\"ALL\",SUM(F78:AI78),'Product benefit & adoption'!$G$4=\"2020-25\",SUM(K78:AI78),'Product benefit & adoption'!$G$4=\"2015-20\",SUM(F78:AD78))","v":0},{"$f":"F27*'PV calculation'!U$23","v":0},{"$f":"G27*'PV calculation'!V$23","v":0},{"$f":"H27*'PV calculation'!W$23","v":0},{"$f":"I27*'PV calculation'!X$23","v":0},{"$f":"J27*'PV calculation'!Y$23","v":0},{"$f":"K27*'PV calculation'!Z$23","v":0},{"$f":"L27*'PV calculation'!AA$23","v":0},{"$f":"M27*'PV calculation'!AB$23","v":0},{"$f":"N27*'PV calculation'!AC$23","v":0},{"$f":"O27*'PV calculation'!AD$23","v":0},{"$f":"P27*'PV calculation'!AE$23","v":0},{"$f":"Q27*'PV calculation'!AF$23","v":0},{"$f":"R27*'PV calculation'!AG$23","v":0},{"$f":"S27*'PV calculation'!AH$23","v":0},{"$f":"T27*'PV calculation'!AI$23","v":0},{"$f":"U27*'PV calculation'!AJ$23","v":0},{"$f":"V27*'PV calculation'!AK$23","v":0},{"$f":"W27*'PV calculation'!AL$23","v":0},{"$f":"X27*'PV calculation'!AM$23","v":0},{"$f":"Y27*'PV calculation'!AN$23","v":0},{"$f":"Z27*'PV calculation'!AO$23","v":0},{"$f":"AA27*'PV calculation'!AP$23","v":0},{"$f":"AB27*'PV calculation'!AQ$23","v":0},{"$f":"AC27*'PV calculation'!AR$23","v":0},{"$f":"AD27*'PV calculation'!AS$23","v":0},{"$f":"AE27*'PV calculation'!AT$23","v":0},{"$f":"AF27*'PV calculation'!AU$23","v":0},{"$f":"AG27*'PV calculation'!AV$23","v":0},{"$f":"AH27*'PV calculation'!AW$23","v":0},{"$f":"AI27*'PV calculation'!AX$23","v":0}]
[null,23,{"$f":"IF('Product benefit & adoption'!D33=\"\",\"\",'Product benefit & adoption'!D33)","v":""},{"$f":"IF('Product benefit & adoption'!F33=\"\",\"\",'Product benefit & adoption'!F33)","v":""},{"$f":"_xlfn.IFS('Product benefit & adoption'!$G$4=\"ALL\",SUM(F79:AI79),'Product benefit & adoption'!$G$4=\"2020-25\",SUM(K79:AI79),'Product benefit & adoption'!$G$4=\"2015-20\",SUM(F79:AD79))","v":0},{"$f":"F28*'PV calculation'!U$23","v":0},{"$f":"G28*'PV calculation'!V$23","v":0},{"$f":"H28*'PV calculation'!W$23","v":0},{"$f":"I28*'PV calculation'!X$23","v":0},{"$f":"J28*'PV calculation'!Y$23","v":0},{"$f":"K28*'PV calculation'!Z$23","v":0},{"$f":"L28*'PV calculation'!AA$23","v":0},{"$f":"M28*'PV calculation'!AB$23","v":0},{"$f":"N28*'PV calculation'!AC$23","v":0},{"$f":"O28*'PV calculation'!AD$23","v":0},{"$f":"P28*'PV calculation'!AE$23","v":0},{"$f":"Q28*'PV calculation'!AF$23","v":0},{"$f":"R28*'PV calculation'!AG$23","v":0},{"$f":"S28*'PV calculation'!AH$23","v":0},{"$f":"T28*'PV calculation'!AI$23","v":0},{"$f":"U28*'PV calculation'!AJ$23","v":0},{"$f":"V28*'PV calculation'!AK$23","v":0},{"$f":"W28*'PV calculation'!AL$23","v":0},{"$f":"X28*'PV calculation'!AM$23","v":0},{"$f":"Y28*'PV calculation'!AN$23","v":0},{"$f":"Z28*'PV calculation'!AO$23","v":0},{"$f":"AA28*'PV calculation'!AP$23","v":0},{"$f":"AB28*'PV calculation'!AQ$23","v":0},{"$f":"AC28*'PV calculation'!AR$23","v":0},{"$f":"AD28*'PV calculation'!AS$23","v":0},{"$f":"AE28*'PV calculation'!AT$23","v":0},{"$f":"AF28*'PV calculation'!AU$23","v":0},{"$f":"AG28*'PV calculation'!AV$23","v":0},{"$f":"AH28*'PV calculation'!AW$23","v":0},{"$f":"AI28*'PV calculation'!AX$23","v":0}]
[null,24,{"$f":"IF('Product benefit & adoption'!D34=\"\",\"\",'Product benefit & adoption'!D34)","v":""},{"$f":"IF('Product benefit & adoption'!F34=\"\",\"\",'Product benefit & adoption'!F34)","v":""},{"$f":"_xlfn.IFS('Product benefit & adoption'!$G$4=\"ALL\",SUM(F80:AI80),'Product benefit & adoption'!$G$4=\"2020-25\",SUM(K80:AI80),'Product benefit & adoption'!$G$4=\"2015-20\",SUM(F80:AD80))","v":0},{"$f":"F29*'PV calculation'!U$23","v":0},{"$f":"G29*'PV calculation'!V$23","v":0},{"$f":"H29*'PV calculation'!W$23","v":0},{"$f":"I29*'PV calculation'!X$23","v":0},{"$f":"J29*'PV calculation'!Y$23","v":0},{"$f":"K29*'PV calculation'!Z$23","v":0},{"$f":"L29*'PV calculation'!AA$23","v":0},{"$f":"M29*'PV calculation'!AB$23","v":0},{"$f":"N29*'PV calculation'!AC$23","v":0},{"$f":"O29*'PV calculation'!AD$23","v":0},{"$f":"P29*'PV calculation'!AE$23","v":0},{"$f":"Q29*'PV calculation'!AF$23","v":0},{"$f":"R29*'PV calculation'!AG$23","v":0},{"$f":"S29*'PV calculation'!AH$23","v":0},{"$f":"T29*'PV calculation'!AI$23","v":0},{"$f":"U29*'PV calculation'!AJ$23","v":0},{"$f":"V29*'PV calculation'!AK$23","v":0},{"$f":"W29*'PV calculation'!AL$23","v":0},{"$f":"X29*'PV calculation'!AM$23","v":0},{"$f":"Y29*'PV calculation'!AN$23","v":0},{"$f":"Z29*'PV calculation'!AO$23","v":0},{"$f":"AA29*'PV calculation'!AP$23","v":0},{"$f":"AB29*'PV calculation'!AQ$23","v":0},{"$f":"AC29*'PV calculation'!AR$23","v":0},{"$f":"AD29*'PV calculation'!AS$23","v":0},{"$f":"AE29*'PV calculation'!AT$23","v":0},{"$f":"AF29*'PV calculation'!AU$23","v":0},{"$f":"AG29*'PV calculation'!AV$23","v":0},{"$f":"AH29*'PV calculation'!AW$23","v":0},{"$f":"AI29*'PV calculation'!AX$23","v":0}]
[null,25,{"$f":"IF('Product benefit & adoption'!D35=\"\",\"\",'Product benefit & adoption'!D35)","v":""},{"$f":"IF('Product benefit & adoption'!F35=\"\",\"\",'Product benefit & adoption'!F35)","v":""},{"$f":"_xlfn.IFS('Product benefit & adoption'!$G$4=\"ALL\",SUM(F81:AI81),'Product benefit & adoption'!$G$4=\"2020-25\",SUM(K81:AI81),'Product benefit & adoption'!$G$4=\"2015-20\",SUM(F81:AD81))","v":0},{"$f":"F30*'PV calculation'!U$23","v":0},{"$f":"G30*'PV calculation'!V$23","v":0},{"$f":"H30*'PV calculation'!W$23","v":0},{"$f":"I30*'PV calculation'!X$23","v":0},{"$f":"J30*'PV calculation'!Y$23","v":0},{"$f":"K30*'PV calculation'!Z$23","v":0},{"$f":"L30*'PV calculation'!AA$23","v":0},{"$f":"M30*'PV calculation'!AB$23","v":0},{"$f":"N30*'PV calculation'!AC$23","v":0},{"$f":"O30*'PV calculation'!AD$23","v":0},{"$f":"P30*'PV calculation'!AE$23","v":0},{"$f":"Q30*'PV calculation'!AF$23","v":0},{"$f":"R30*'PV calculation'!AG$23","v":0},{"$f":"S30*'PV calculation'!AH$23","v":0},{"$f":"T30*'PV calculation'!AI$23","v":0},{"$f":"U30*'PV calculation'!AJ$23","v":0},{"$f":"V30*'PV calculation'!AK$23","v":0},{"$f":"W30*'PV calculation'!AL$23","v":0},{"$f":"X30*'PV calculation'!AM$23","v":0},{"$f":"Y30*'PV calculation'!AN$23","v":0},{"$f":"Z30*'PV calculation'!AO$23","v":0},{"$f":"AA30*'PV calculation'!AP$23","v":0},{"$f":"AB30*'PV calculation'!AQ$23","v":0},{"$f":"AC30*'PV calculation'!AR$23","v":0},{"$f":"AD30*'PV calculation'!AS$23","v":0},{"$f":"AE30*'PV calculation'!AT$23","v":0},{"$f":"AF30*'PV calculation'!AU$23","v":0},{"$f":"AG30*'PV calculation'!AV$23","v":0},{"$f":"AH30*'PV calculation'!AW$23","v":0},{"$f":"AI30*'PV calculation'!AX$23","v":0}]
[null,26,{"$f":"IF('Product benefit & adoption'!D36=\"\",\"\",'Product benefit & adoption'!D36)","v":""},{"$f":"IF('Product benefit & adoption'!F36=\"\",\"\",'Product benefit & adoption'!F36)","v":""},{"$f":"_xlfn.IFS('Product benefit & adoption'!$G$4=\"ALL\",SUM(F82:AI82),'Product benefit & adoption'!$G$4=\"2020-25\",SUM(K82:AI82),'Product benefit & adoption'!$G$4=\"2015-20\",SUM(F82:AD82))","v":0},{"$f":"F31*'PV calculation'!U$23","v":0},{"$f":"G31*'PV calculation'!V$23","v":0},{"$f":"H31*'PV calculation'!W$23","v":0},{"$f":"I31*'PV calculation'!X$23","v":0},{"$f":"J31*'PV calculation'!Y$23","v":0},{"$f":"K31*'PV calculation'!Z$23","v":0},{"$f":"L31*'PV calculation'!AA$23","v":0},{"$f":"M31*'PV calculation'!AB$23","v":0},{"$f":"N31*'PV calculation'!AC$23","v":0},{"$f":"O31*'PV calculation'!AD$23","v":0},{"$f":"P31*'PV calculation'!AE$23","v":0},{"$f":"Q31*'PV calculation'!AF$23","v":0},{"$f":"R31*'PV calculation'!AG$23","v":0},{"$f":"S31*'PV calculation'!AH$23","v":0},{"$f":"T31*'PV calculation'!AI$23","v":0},{"$f":"U31*'PV calculation'!AJ$23","v":0},{"$f":"V31*'PV calculation'!AK$23","v":0},{"$f":"W31*'PV calculation'!AL$23","v":0},{"$f":"X31*'PV calculation'!AM$23","v":0},{"$f":"Y31*'PV calculation'!AN$23","v":0},{"$f":"Z31*'PV calculation'!AO$23","v":0},{"$f":"AA31*'PV calculation'!AP$23","v":0},{"$f":"AB31*'PV calculation'!AQ$23","v":0},{"$f":"AC31*'PV calculation'!AR$23","v":0},{"$f":"AD31*'PV calculation'!AS$23","v":0},{"$f":"AE31*'PV calculation'!AT$23","v":0},{"$f":"AF31*'PV calculation'!AU$23","v":0},{"$f":"AG31*'PV calculation'!AV$23","v":0},{"$f":"AH31*'PV calculation'!AW$23","v":0},{"$f":"AI31*'PV calculation'!AX$23","v":0}]
[null,27,{"$f":"IF('Product benefit & adoption'!D37=\"\",\"\",'Product benefit & adoption'!D37)","v":""},{"$f":"IF('Product benefit & adoption'!F37=\"\",\"\",'Product benefit & adoption'!F37)","v":""},{"$f":"_xlfn.IFS('Product benefit & adoption'!$G$4=\"ALL\",SUM(F83:AI83),'Product benefit & adoption'!$G$4=\"2020-25\",SUM(K83:AI83),'Product benefit & adoption'!$G$4=\"2015-20\",SUM(F83:AD83))","v":0},{"$f":"F32*'PV calculation'!U$23","v":0},{"$f":"G32*'PV calculation'!V$23","v":0},{"$f":"H32*'PV calculation'!W$23","v":0},{"$f":"I32*'PV calculation'!X$23","v":0},{"$f":"J32*'PV calculation'!Y$23","v":0},{"$f":"K32*'PV calculation'!Z$23","v":0},{"$f":"L32*'PV calculation'!AA$23","v":0},{"$f":"M32*'PV calculation'!AB$23","v":0},{"$f":"N32*'PV calculation'!AC$23","v":0},{"$f":"O32*'PV calculation'!AD$23","v":0},{"$f":"P32*'PV calculation'!AE$23","v":0},{"$f":"Q32*'PV calculation'!AF$23","v":0},{"$f":"R32*'PV calculation'!AG$23","v":0},{"$f":"S32*'PV calculation'!AH$23","v":0},{"$f":"T32*'PV calculation'!AI$23","v":0},{"$f":"U32*'PV calculation'!AJ$23","v":0},{"$f":"V32*'PV calculation'!AK$23","v":0},{"$f":"W32*'PV calculation'!AL$23","v":0},{"$f":"X32*'PV calculation'!AM$23","v":0},{"$f":"Y32*'PV calculation'!AN$23","v":0},{"$f":"Z32*'PV calculation'!AO$23","v":0},{"$f":"AA32*'PV calculation'!AP$23","v":0},{"$f":"AB32*'PV calculation'!AQ$23","v":0},{"$f":"AC32*'PV calculation'!AR$23","v":0},{"$f":"AD32*'PV calculation'!AS$23","v":0},{"$f":"AE32*'PV calculation'!AT$23","v":0},{"$f":"AF32*'PV calculation'!AU$23","v":0},{"$f":"AG32*'PV calculation'!AV$23","v":0},{"$f":"AH32*'PV calculation'!AW$23","v":0},{"$f":"AI32*'PV calculation'!AX$23","v":0}]
[null,28,{"$f":"IF('Product benefit & adoption'!D38=\"\",\"\",'Product benefit & adoption'!D38)","v":""},{"$f":"IF('Product benefit & adoption'!F38=\"\",\"\",'Product benefit & adoption'!F38)","v":""},{"$f":"_xlfn.IFS('Product benefit & adoption'!$G$4=\"ALL\",SUM(F84:AI84),'Product benefit & adoption'!$G$4=\"2020-25\",SUM(K84:AI84),'Product benefit & adoption'!$G$4=\"2015-20\",SUM(F84:AD84))","v":0},{"$f":"F33*'PV calculation'!U$23","v":0},{"$f":"G33*'PV calculation'!V$23","v":0},{"$f":"H33*'PV calculation'!W$23","v":0},{"$f":"I33*'PV calculation'!X$23","v":0},{"$f":"J33*'PV calculation'!Y$23","v":0},{"$f":"K33*'PV calculation'!Z$23","v":0},{"$f":"L33*'PV calculation'!AA$23","v":0},{"$f":"M33*'PV calculation'!AB$23","v":0},{"$f":"N33*'PV calculation'!AC$23","v":0},{"$f":"O33*'PV calculation'!AD$23","v":0},{"$f":"P33*'PV calculation'!AE$23","v":0},{"$f":"Q33*'PV calculation'!AF$23","v":0},{"$f":"R33*'PV calculation'!AG$23","v":0},{"$f":"S33*'PV calculation'!AH$23","v":0},{"$f":"T33*'PV calculation'!AI$23","v":0},{"$f":"U33*'PV calculation'!AJ$23","v":0},{"$f":"V33*'PV calculation'!AK$23","v":0},{"$f":"W33*'PV calculation'!AL$23","v":0},{"$f":"X33*'PV calculation'!AM$23","v":0},{"$f":"Y33*'PV calculation'!AN$23","v":0},{"$f":"Z33*'PV calculation'!AO$23","v":0},{"$f":"AA33*'PV calculation'!AP$23","v":0},{"$f":"AB33*'PV calculation'!AQ$23","v":0},{"$f":"AC33*'PV calculation'!AR$23","v":0},{"$f":"AD33*'PV calculation'!AS$23","v":0},{"$f":"AE33*'PV calculation'!AT$23","v":0},{"$f":"AF33*'PV calculation'!AU$23","v":0},{"$f":"AG33*'PV calculation'!AV$23","v":0},{"$f":"AH33*'PV calculation'!AW$23","v":0},{"$f":"AI33*'PV calculation'!AX$23","v":0}]
[null,29,{"$f":"IF('Product benefit & adoption'!D39=\"\",\"\",'Product benefit & adoption'!D39)","v":""},{"$f":"IF('Product benefit & adoption'!F39=\"\",\"\",'Product benefit & adoption'!F39)","v":""},{"$f":"_xlfn.IFS('Product benefit & adoption'!$G$4=\"ALL\",SUM(F85:AI85),'Product benefit & adoption'!$G$4=\"2020-25\",SUM(K85:AI85),'Product benefit & adoption'!$G$4=\"2015-20\",SUM(F85:AD85))","v":0},{"$f":"F34*'PV calculation'!U$23","v":0},{"$f":"G34*'PV calculation'!V$23","v":0},{"$f":"H34*'PV calculation'!W$23","v":0},{"$f":"I34*'PV calculation'!X$23","v":0},{"$f":"J34*'PV calculation'!Y$23","v":0},{"$f":"K34*'PV calculation'!Z$23","v":0},{"$f":"L34*'PV calculation'!AA$23","v":0},{"$f":"M34*'PV calculation'!AB$23","v":0},{"$f":"N34*'PV calculation'!AC$23","v":0},{"$f":"O34*'PV calculation'!AD$23","v":0},{"$f":"P34*'PV calculation'!AE$23","v":0},{"$f":"Q34*'PV calculation'!AF$23","v":0},{"$f":"R34*'PV calculation'!AG$23","v":0},{"$f":"S34*'PV calculation'!AH$23","v":0},{"$f":"T34*'PV calculation'!AI$23","v":0},{"$f":"U34*'PV calculation'!AJ$23","v":0},{"$f":"V34*'PV calculation'!AK$23","v":0},{"$f":"W34*'PV calculation'!AL$23","v":0},{"$f":"X34*'PV calculation'!AM$23","v":0},{"$f":"Y34*'PV calculation'!AN$23","v":0},{"$f":"Z34*'PV calculation'!AO$23","v":0},{"$f":"AA34*'PV calculation'!AP$23","v":0},{"$f":"AB34*'PV calculation'!AQ$23","v":0},{"$f":"AC34*'PV calculation'!AR$23","v":0},{"$f":"AD34*'PV calculation'!AS$23","v":0},{"$f":"AE34*'PV calculation'!AT$23","v":0},{"$f":"AF34*'PV calculation'!AU$23","v":0},{"$f":"AG34*'PV calculation'!AV$23","v":0},{"$f":"AH34*'PV calculation'!AW$23","v":0},{"$f":"AI34*'PV calculation'!AX$23","v":0}]
[null,30,{"$f":"IF('Product benefit & adoption'!D40=\"\",\"\",'Product benefit & adoption'!D40)","v":""},{"$f":"IF('Product benefit & adoption'!F40=\"\",\"\",'Product benefit & adoption'!F40)","v":""},{"$f":"_xlfn.IFS('Product benefit & adoption'!$G$4=\"ALL\",SUM(F86:AI86),'Product benefit & adoption'!$G$4=\"2020-25\",SUM(K86:AI86),'Product benefit & adoption'!$G$4=\"2015-20\",SUM(F86:AD86))","v":0},{"$f":"F35*'PV calculation'!U$23","v":0},{"$f":"G35*'PV calculation'!V$23","v":0},{"$f":"H35*'PV calculation'!W$23","v":0},{"$f":"I35*'PV calculation'!X$23","v":0},{"$f":"J35*'PV calculation'!Y$23","v":0},{"$f":"K35*'PV calculation'!Z$23","v":0},{"$f":"L35*'PV calculation'!AA$23","v":0},{"$f":"M35*'PV calculation'!AB$23","v":0},{"$f":"N35*'PV calculation'!AC$23","v":0},{"$f":"O35*'PV calculation'!AD$23","v":0},{"$f":"P35*'PV calculation'!AE$23","v":0},{"$f":"Q35*'PV calculation'!AF$23","v":0},{"$f":"R35*'PV calculation'!AG$23","v":0},{"$f":"S35*'PV calculation'!AH$23","v":0},{"$f":"T35*'PV calculation'!AI$23","v":0},{"$f":"U35*'PV calculation'!AJ$23","v":0},{"$f":"V35*'PV calculation'!AK$23","v":0},{"$f":"W35*'PV calculation'!AL$23","v":0},{"$f":"X35*'PV calculation'!AM$23","v":0},{"$f":"Y35*'PV calculation'!AN$23","v":0},{"$f":"Z35*'PV calculation'!AO$23","v":0},{"$f":"AA35*'PV calculation'!AP$23","v":0},{"$f":"AB35*'PV calculation'!AQ$23","v":0},{"$f":"AC35*'PV calculation'!AR$23","v":0},{"$f":"AD35*'PV calculation'!AS$23","v":0},{"$f":"AE35*'PV calculation'!AT$23","v":0},{"$f":"AF35*'PV calculation'!AU$23","v":0},{"$f":"AG35*'PV calculation'!AV$23","v":0},{"$f":"AH35*'PV calculation'!AW$23","v":0},{"$f":"AI35*'PV calculation'!AX$23","v":0}]
[null,31,{"$f":"IF('Product benefit & adoption'!D41=\"\",\"\",'Product benefit & adoption'!D41)","v":""},{"$f":"IF('Product benefit & adoption'!F41=\"\",\"\",'Product benefit & adoption'!F41)","v":""},{"$f":"_xlfn.IFS('Product benefit & adoption'!$G$4=\"ALL\",SUM(F87:AI87),'Product benefit & adoption'!$G$4=\"2020-25\",SUM(K87:AI87),'Product benefit & adoption'!$G$4=\"2015-20\",SUM(F87:AD87))","v":0},{"$f":"F36*'PV calculation'!U$23","v":0},{"$f":"G36*'PV calculation'!V$23","v":0},{"$f":"H36*'PV calculation'!W$23","v":0},{"$f":"I36*'PV calculation'!X$23","v":0},{"$f":"J36*'PV calculation'!Y$23","v":0},{"$f":"K36*'PV calculation'!Z$23","v":0},{"$f":"L36*'PV calculation'!AA$23","v":0},{"$f":"M36*'PV calculation'!AB$23","v":0},{"$f":"N36*'PV calculation'!AC$23","v":0},{"$f":"O36*'PV calculation'!AD$23","v":0},{"$f":"P36*'PV calculation'!AE$23","v":0},{"$f":"Q36*'PV calculation'!AF$23","v":0},{"$f":"R36*'PV calculation'!AG$23","v":0},{"$f":"S36*'PV calculation'!AH$23","v":0},{"$f":"T36*'PV calculation'!AI$23","v":0},{"$f":"U36*'PV calculation'!AJ$23","v":0},{"$f":"V36*'PV calculation'!AK$23","v":0},{"$f":"W36*'PV calculation'!AL$23","v":0},{"$f":"X36*'PV calculation'!AM$23","v":0},{"$f":"Y36*'PV calculation'!AN$23","v":0},{"$f":"Z36*'PV calculation'!AO$23","v":0},{"$f":"AA36*'PV calculation'!AP$23","v":0},{"$f":"AB36*'PV calculation'!AQ$23","v":0},{"$f":"AC36*'PV calculation'!AR$23","v":0},{"$f":"AD36*'PV calculation'!AS$23","v":0},{"$f":"AE36*'PV calculation'!AT$23","v":0},{"$f":"AF36*'PV calculation'!AU$23","v":0},{"$f":"AG36*'PV calculation'!AV$23","v":0},{"$f":"AH36*'PV calculation'!AW$23","v":0},{"$f":"AI36*'PV calculation'!AX$23","v":0}]
[null,32,{"$f":"IF('Product benefit & adoption'!D42=\"\",\"\",'Product benefit & adoption'!D42)","v":""},{"$f":"IF('Product benefit & adoption'!F42=\"\",\"\",'Product benefit & adoption'!F42)","v":""},{"$f":"_xlfn.IFS('Product benefit & adoption'!$G$4=\"ALL\",SUM(F88:AI88),'Product benefit & adoption'!$G$4=\"2020-25\",SUM(K88:AI88),'Product benefit & adoption'!$G$4=\"2015-20\",SUM(F88:AD88))","v":0},{"$f":"F37*'PV calculation'!U$23","v":0},{"$f":"G37*'PV calculation'!V$23","v":0},{"$f":"H37*'PV calculation'!W$23","v":0},{"$f":"I37*'PV calculation'!X$23","v":0},{"$f":"J37*'PV calculation'!Y$23","v":0},{"$f":"K37*'PV calculation'!Z$23","v":0},{"$f":"L37*'PV calculation'!AA$23","v":0},{"$f":"M37*'PV calculation'!AB$23","v":0},{"$f":"N37*'PV calculation'!AC$23","v":0},{"$f":"O37*'PV calculation'!AD$23","v":0},{"$f":"P37*'PV calculation'!AE$23","v":0},{"$f":"Q37*'PV calculation'!AF$23","v":0},{"$f":"R37*'PV calculation'!AG$23","v":0},{"$f":"S37*'PV calculation'!AH$23","v":0},{"$f":"T37*'PV calculation'!AI$23","v":0},{"$f":"U37*'PV calculation'!AJ$23","v":0},{"$f":"V37*'PV calculation'!AK$23","v":0},{"$f":"W37*'PV calculation'!AL$23","v":0},{"$f":"X37*'PV calculation'!AM$23","v":0},{"$f":"Y37*'PV calculation'!AN$23","v":0},{"$f":"Z37*'PV calculation'!AO$23","v":0},{"$f":"AA37*'PV calculation'!AP$23","v":0},{"$f":"AB37*'PV calculation'!AQ$23","v":0},{"$f":"AC37*'PV calculation'!AR$23","v":0},{"$f":"AD37*'PV calculation'!AS$23","v":0},{"$f":"AE37*'PV calculation'!AT$23","v":0},{"$f":"AF37*'PV calculation'!AU$23","v":0},{"$f":"AG37*'PV calculation'!AV$23","v":0},{"$f":"AH37*'PV calculation'!AW$23","v":0},{"$f":"AI37*'PV calculation'!AX$23","v":0}]
[null,33,{"$f":"IF('Product benefit & adoption'!D43=\"\",\"\",'Product benefit & adoption'!D43)","v":""},{"$f":"IF('Product benefit & adoption'!F43=\"\",\"\",'Product benefit & adoption'!F43)","v":""},{"$f":"_xlfn.IFS('Product benefit & adoption'!$G$4=\"ALL\",SUM(F89:AI89),'Product benefit & adoption'!$G$4=\"2020-25\",SUM(K89:AI89),'Product benefit & adoption'!$G$4=\"2015-20\",SUM(F89:AD89))","v":0},{"$f":"F38*'PV calculation'!U$23","v":0},{"$f":"G38*'PV calculation'!V$23","v":0},{"$f":"H38*'PV calculation'!W$23","v":0},{"$f":"I38*'PV calculation'!X$23","v":0},{"$f":"J38*'PV calculation'!Y$23","v":0},{"$f":"K38*'PV calculation'!Z$23","v":0},{"$f":"L38*'PV calculation'!AA$23","v":0},{"$f":"M38*'PV calculation'!AB$23","v":0},{"$f":"N38*'PV calculation'!AC$23","v":0},{"$f":"O38*'PV calculation'!AD$23","v":0},{"$f":"P38*'PV calculation'!AE$23","v":0},{"$f":"Q38*'PV calculation'!AF$23","v":0},{"$f":"R38*'PV calculation'!AG$23","v":0},{"$f":"S38*'PV calculation'!AH$23","v":0},{"$f":"T38*'PV calculation'!AI$23","v":0},{"$f":"U38*'PV calculation'!AJ$23","v":0},{"$f":"V38*'PV calculation'!AK$23","v":0},{"$f":"W38*'PV calculation'!AL$23","v":0},{"$f":"X38*'PV calculation'!AM$23","v":0},{"$f":"Y38*'PV calculation'!AN$23","v":0},{"$f":"Z38*'PV calculation'!AO$23","v":0},{"$f":"AA38*'PV calculation'!AP$23","v":0},{"$f":"AB38*'PV calculation'!AQ$23","v":0},{"$f":"AC38*'PV calculation'!AR$23","v":0},{"$f":"AD38*'PV calculation'!AS$23","v":0},{"$f":"AE38*'PV calculation'!AT$23","v":0},{"$f":"AF38*'PV calculation'!AU$23","v":0},{"$f":"AG38*'PV calculation'!AV$23","v":0},{"$f":"AH38*'PV calculation'!AW$23","v":0},{"$f":"AI38*'PV calculation'!AX$23","v":0}]
[null,34,{"$f":"IF('Product benefit & adoption'!D44=\"\",\"\",'Product benefit & adoption'!D44)","v":""},{"$f":"IF('Product benefit & adoption'!F44=\"\",\"\",'Product benefit & adoption'!F44)","v":""},{"$f":"_xlfn.IFS('Product benefit & adoption'!$G$4=\"ALL\",SUM(F90:AI90),'Product benefit & adoption'!$G$4=\"2020-25\",SUM(K90:AI90),'Product benefit & adoption'!$G$4=\"2015-20\",SUM(F90:AD90))","v":0},{"$f":"F39*'PV calculation'!U$23","v":0},{"$f":"G39*'PV calculation'!V$23","v":0},{"$f":"H39*'PV calculation'!W$23","v":0},{"$f":"I39*'PV calculation'!X$23","v":0},{"$f":"J39*'PV calculation'!Y$23","v":0},{"$f":"K39*'PV calculation'!Z$23","v":0},{"$f":"L39*'PV calculation'!AA$23","v":0},{"$f":"M39*'PV calculation'!AB$23","v":0},{"$f":"N39*'PV calculation'!AC$23","v":0},{"$f":"O39*'PV calculation'!AD$23","v":0},{"$f":"P39*'PV calculation'!AE$23","v":0},{"$f":"Q39*'PV calculation'!AF$23","v":0},{"$f":"R39*'PV calculation'!AG$23","v":0},{"$f":"S39*'PV calculation'!AH$23","v":0},{"$f":"T39*'PV calculation'!AI$23","v":0},{"$f":"U39*'PV calculation'!AJ$23","v":0},{"$f":"V39*'PV calculation'!AK$23","v":0},{"$f":"W39*'PV calculation'!AL$23","v":0},{"$f":"X39*'PV calculation'!AM$23","v":0},{"$f":"Y39*'PV calculation'!AN$23","v":0},{"$f":"Z39*'PV calculation'!AO$23","v":0},{"$f":"AA39*'PV calculation'!AP$23","v":0},{"$f":"AB39*'PV calculation'!AQ$23","v":0},{"$f":"AC39*'PV calculation'!AR$23","v":0},{"$f":"AD39*'PV calculation'!AS$23","v":0},{"$f":"AE39*'PV calculation'!AT$23","v":0},{"$f":"AF39*'PV calculation'!AU$23","v":0},{"$f":"AG39*'PV calculation'!AV$23","v":0},{"$f":"AH39*'PV calculation'!AW$23","v":0},{"$f":"AI39*'PV calculation'!AX$23","v":0}]
[null,35,{"$f":"IF('Product benefit & adoption'!D45=\"\",\"\",'Product benefit & adoption'!D45)","v":""},{"$f":"IF('Product benefit & adoption'!F45=\"\",\"\",'Product benefit & adoption'!F45)","v":""},{"$f":"_xlfn.IFS('Product benefit & adoption'!$G$4=\"ALL\",SUM(F91:AI91),'Product benefit & adoption'!$G$4=\"2020-25\",SUM(K91:AI91),'Product benefit & adoption'!$G$4=\"2015-20\",SUM(F91:AD91))","v":0},{"$f":"F40*'PV calculation'!U$23","v":0},{"$f":"G40*'PV calculation'!V$23","v":0},{"$f":"H40*'PV calculation'!W$23","v":0},{"$f":"I40*'PV calculation'!X$23","v":0},{"$f":"J40*'PV calculation'!Y$23","v":0},{"$f":"K40*'PV calculation'!Z$23","v":0},{"$f":"L40*'PV calculation'!AA$23","v":0},{"$f":"M40*'PV calculation'!AB$23","v":0},{"$f":"N40*'PV calculation'!AC$23","v":0},{"$f":"O40*'PV calculation'!AD$23","v":0},{"$f":"P40*'PV calculation'!AE$23","v":0},{"$f":"Q40*'PV calculation'!AF$23","v":0},{"$f":"R40*'PV calculation'!AG$23","v":0},{"$f":"S40*'PV calculation'!AH$23","v":0},{"$f":"T40*'PV calculation'!AI$23","v":0},{"$f":"U40*'PV calculation'!AJ$23","v":0},{"$f":"V40*'PV calculation'!AK$23","v":0},{"$f":"W40*'PV calculation'!AL$23","v":0},{"$f":"X40*'PV calculation'!AM$23","v":0},{"$f":"Y40*'PV calculation'!AN$23","v":0},{"$f":"Z40*'PV calculation'!AO$23","v":0},{"$f":"AA40*'PV calculation'!AP$23","v":0},{"$f":"AB40*'PV calculation'!AQ$23","v":0},{"$f":"AC40*'PV calculation'!AR$23","v":0},{"$f":"AD40*'PV calculation'!AS$23","v":0},{"$f":"AE40*'PV calculation'!AT$23","v":0},{"$f":"AF40*'PV calculation'!AU$23","v":0},{"$f":"AG40*'PV calculation'!AV$23","v":0},{"$f":"AH40*'PV calculation'!AW$23","v":0},{"$f":"AI40*'PV calculation'!AX$23","v":0}]
[null,36,{"$f":"IF('Product benefit & adoption'!D46=\"\",\"\",'Product benefit & adoption'!D46)","v":""},{"$f":"IF('Product benefit & adoption'!F46=\"\",\"\",'Product benefit & adoption'!F46)","v":""},{"$f":"_xlfn.IFS('Product benefit & adoption'!$G$4=\"ALL\",SUM(F92:AI92),'Product benefit & adoption'!$G$4=\"2020-25\",SUM(K92:AI92),'Product benefit & adoption'!$G$4=\"2015-20\",SUM(F92:AD92))","v":0},{"$f":"F41*'PV calculation'!U$23","v":0},{"$f":"G41*'PV calculation'!V$23","v":0},{"$f":"H41*'PV calculation'!W$23","v":0},{"$f":"I41*'PV calculation'!X$23","v":0},{"$f":"J41*'PV calculation'!Y$23","v":0},{"$f":"K41*'PV calculation'!Z$23","v":0},{"$f":"L41*'PV calculation'!AA$23","v":0},{"$f":"M41*'PV calculation'!AB$23","v":0},{"$f":"N41*'PV calculation'!AC$23","v":0},{"$f":"O41*'PV calculation'!AD$23","v":0},{"$f":"P41*'PV calculation'!AE$23","v":0},{"$f":"Q41*'PV calculation'!AF$23","v":0},{"$f":"R41*'PV calculation'!AG$23","v":0},{"$f":"S41*'PV calculation'!AH$23","v":0},{"$f":"T41*'PV calculation'!AI$23","v":0},{"$f":"U41*'PV calculation'!AJ$23","v":0},{"$f":"V41*'PV calculation'!AK$23","v":0},{"$f":"W41*'PV calculation'!AL$23","v":0},{"$f":"X41*'PV calculation'!AM$23","v":0},{"$f":"Y41*'PV calculation'!AN$23","v":0},{"$f":"Z41*'PV calculation'!AO$23","v":0},{"$f":"AA41*'PV calculation'!AP$23","v":0},{"$f":"AB41*'PV calculation'!AQ$23","v":0},{"$f":"AC41*'PV calculation'!AR$23","v":0},{"$f":"AD41*'PV calculation'!AS$23","v":0},{"$f":"AE41*'PV calculation'!AT$23","v":0},{"$f":"AF41*'PV calculation'!AU$23","v":0},{"$f":"AG41*'PV calculation'!AV$23","v":0},{"$f":"AH41*'PV calculation'!AW$23","v":0},{"$f":"AI41*'PV calculation'!AX$23","v":0}]
[null,37,{"$f":"IF('Product benefit & adoption'!D47=\"\",\"\",'Product benefit & adoption'!D47)","v":""},{"$f":"IF('Product benefit & adoption'!F47=\"\",\"\",'Product benefit & adoption'!F47)","v":""},{"$f":"_xlfn.IFS('Product benefit & adoption'!$G$4=\"ALL\",SUM(F93:AI93),'Product benefit & adoption'!$G$4=\"2020-25\",SUM(K93:AI93),'Product benefit & adoption'!$G$4=\"2015-20\",SUM(F93:AD93))","v":0},{"$f":"F42*'PV calculation'!U$23","v":0},{"$f":"G42*'PV calculation'!V$23","v":0},{"$f":"H42*'PV calculation'!W$23","v":0},{"$f":"I42*'PV calculation'!X$23","v":0},{"$f":"J42*'PV calculation'!Y$23","v":0},{"$f":"K42*'PV calculation'!Z$23","v":0},{"$f":"L42*'PV calculation'!AA$23","v":0},{"$f":"M42*'PV calculation'!AB$23","v":0},{"$f":"N42*'PV calculation'!AC$23","v":0},{"$f":"O42*'PV calculation'!AD$23","v":0},{"$f":"P42*'PV calculation'!AE$23","v":0},{"$f":"Q42*'PV calculation'!AF$23","v":0},{"$f":"R42*'PV calculation'!AG$23","v":0},{"$f":"S42*'PV calculation'!AH$23","v":0},{"$f":"T42*'PV calculation'!AI$23","v":0},{"$f":"U42*'PV calculation'!AJ$23","v":0},{"$f":"V42*'PV calculation'!AK$23","v":0},{"$f":"W42*'PV calculation'!AL$23","v":0},{"$f":"X42*'PV calculation'!AM$23","v":0},{"$f":"Y42*'PV calculation'!AN$23","v":0},{"$f":"Z42*'PV calculation'!AO$23","v":0},{"$f":"AA42*'PV calculation'!AP$23","v":0},{"$f":"AB42*'PV calculation'!AQ$23","v":0},{"$f":"AC42*'PV calculation'!AR$23","v":0},{"$f":"AD42*'PV calculation'!AS$23","v":0},{"$f":"AE42*'PV calculation'!AT$23","v":0},{"$f":"AF42*'PV calculation'!AU$23","v":0},{"$f":"AG42*'PV calculation'!AV$23","v":0},{"$f":"AH42*'PV calculation'!AW$23","v":0},{"$f":"AI42*'PV calculation'!AX$23","v":0}]
[null,38,{"$f":"IF('Product benefit & adoption'!D48=\"\",\"\",'Product benefit & adoption'!D48)","v":""},{"$f":"IF('Product benefit & adoption'!F48=\"\",\"\",'Product benefit & adoption'!F48)","v":""},{"$f":"_xlfn.IFS('Product benefit & adoption'!$G$4=\"ALL\",SUM(F94:AI94),'Product benefit & adoption'!$G$4=\"2020-25\",SUM(K94:AI94),'Product benefit & adoption'!$G$4=\"2015-20\",SUM(F94:AD94))","v":0},{"$f":"F43*'PV calculation'!U$23","v":0},{"$f":"G43*'PV calculation'!V$23","v":0},{"$f":"H43*'PV calculation'!W$23","v":0},{"$f":"I43*'PV calculation'!X$23","v":0},{"$f":"J43*'PV calculation'!Y$23","v":0},{"$f":"K43*'PV calculation'!Z$23","v":0},{"$f":"L43*'PV calculation'!AA$23","v":0},{"$f":"M43*'PV calculation'!AB$23","v":0},{"$f":"N43*'PV calculation'!AC$23","v":0},{"$f":"O43*'PV calculation'!AD$23","v":0},{"$f":"P43*'PV calculation'!AE$23","v":0},{"$f":"Q43*'PV calculation'!AF$23","v":0},{"$f":"R43*'PV calculation'!AG$23","v":0},{"$f":"S43*'PV calculation'!AH$23","v":0},{"$f":"T43*'PV calculation'!AI$23","v":0},{"$f":"U43*'PV calculation'!AJ$23","v":0},{"$f":"V43*'PV calculation'!AK$23","v":0},{"$f":"W43*'PV calculation'!AL$23","v":0},{"$f":"X43*'PV calculation'!AM$23","v":0},{"$f":"Y43*'PV calculation'!AN$23","v":0},{"$f":"Z43*'PV calculation'!AO$23","v":0},{"$f":"AA43*'PV calculation'!AP$23","v":0},{"$f":"AB43*'PV calculation'!AQ$23","v":0},{"$f":"AC43*'PV calculation'!AR$23","v":0},{"$f":"AD43*'PV calculation'!AS$23","v":0},{"$f":"AE43*'PV calculation'!AT$23","v":0},{"$f":"AF43*'PV calculation'!AU$23","v":0},{"$f":"AG43*'PV calculation'!AV$23","v":0},{"$f":"AH43*'PV calculation'!AW$23","v":0},{"$f":"AI43*'PV calculation'!AX$23","v":0}]
[null,39,{"$f":"IF('Product benefit & adoption'!D49=\"\",\"\",'Product benefit & adoption'!D49)","v":""},{"$f":"IF('Product benefit & adoption'!F49=\"\",\"\",'Product benefit & adoption'!F49)","v":""},{"$f":"_xlfn.IFS('Product benefit & adoption'!$G$4=\"ALL\",SUM(F95:AI95),'Product benefit & adoption'!$G$4=\"2020-25\",SUM(K95:AI95),'Product benefit & adoption'!$G$4=\"2015-20\",SUM(F95:AD95))","v":0},{"$f":"F44*'PV calculation'!U$23","v":0},{"$f":"G44*'PV calculation'!V$23","v":0},{"$f":"H44*'PV calculation'!W$23","v":0},{"$f":"I44*'PV calculation'!X$23","v":0},{"$f":"J44*'PV calculation'!Y$23","v":0},{"$f":"K44*'PV calculation'!Z$23","v":0},{"$f":"L44*'PV calculation'!AA$23","v":0},{"$f":"M44*'PV calculation'!AB$23","v":0},{"$f":"N44*'PV calculation'!AC$23","v":0},{"$f":"O44*'PV calculation'!AD$23","v":0},{"$f":"P44*'PV calculation'!AE$23","v":0},{"$f":"Q44*'PV calculation'!AF$23","v":0},{"$f":"R44*'PV calculation'!AG$23","v":0},{"$f":"S44*'PV calculation'!AH$23","v":0},{"$f":"T44*'PV calculation'!AI$23","v":0},{"$f":"U44*'PV calculation'!AJ$23","v":0},{"$f":"V44*'PV calculation'!AK$23","v":0},{"$f":"W44*'PV calculation'!AL$23","v":0},{"$f":"X44*'PV calculation'!AM$23","v":0},{"$f":"Y44*'PV calculation'!AN$23","v":0},{"$f":"Z44*'PV calculation'!AO$23","v":0},{"$f":"AA44*'PV calculation'!AP$23","v":0},{"$f":"AB44*'PV calculation'!AQ$23","v":0},{"$f":"AC44*'PV calculation'!AR$23","v":0},{"$f":"AD44*'PV calculation'!AS$23","v":0},{"$f":"AE44*'PV calculation'!AT$23","v":0},{"$f":"AF44*'PV calculation'!AU$23","v":0},{"$f":"AG44*'PV calculation'!AV$23","v":0},{"$f":"AH44*'PV calculation'!AW$23","v":0},{"$f":"AI44*'PV calculation'!AX$23","v":0}]
[null,40,{"$f":"IF('Product benefit & adoption'!D50=\"\",\"\",'Product benefit & adoption'!D50)","v":""},{"$f":"IF('Product benefit & adoption'!F50=\"\",\"\",'Product benefit & adoption'!F50)","v":""},{"$f":"_xlfn.IFS('Product benefit & adoption'!$G$4=\"ALL\",SUM(F96:AI96),'Product benefit & adoption'!$G$4=\"2020-25\",SUM(K96:AI96),'Product benefit & adoption'!$G$4=\"2015-20\",SUM(F96:AD96))","v":0},{"$f":"F45*'PV calculation'!U$23","v":0},{"$f":"G45*'PV calculation'!V$23","v":0},{"$f":"H45*'PV calculation'!W$23","v":0},{"$f":"I45*'PV calculation'!X$23","v":0},{"$f":"J45*'PV calculation'!Y$23","v":0},{"$f":"K45*'PV calculation'!Z$23","v":0},{"$f":"L45*'PV calculation'!AA$23","v":0},{"$f":"M45*'PV calculation'!AB$23","v":0},{"$f":"N45*'PV calculation'!AC$23","v":0},{"$f":"O45*'PV calculation'!AD$23","v":0},{"$f":"P45*'PV calculation'!AE$23","v":0},{"$f":"Q45*'PV calculation'!AF$23","v":0},{"$f":"R45*'PV calculation'!AG$23","v":0},{"$f":"S45*'PV calculation'!AH$23","v":0},{"$f":"T45*'PV calculation'!AI$23","v":0},{"$f":"U45*'PV calculation'!AJ$23","v":0},{"$f":"V45*'PV calculation'!AK$23","v":0},{"$f":"W45*'PV calculation'!AL$23","v":0},{"$f":"X45*'PV calculation'!AM$23","v":0},{"$f":"Y45*'PV calculation'!AN$23","v":0},{"$f":"Z45*'PV calculation'!AO$23","v":0},{"$f":"AA45*'PV calculation'!AP$23","v":0},{"$f":"AB45*'PV calculation'!AQ$23","v":0},{"$f":"AC45*'PV calculation'!AR$23","v":0},{"$f":"AD45*'PV calculation'!AS$23","v":0},{"$f":"AE45*'PV calculation'!AT$23","v":0},{"$f":"AF45*'PV calculation'!AU$23","v":0},{"$f":"AG45*'PV calculation'!AV$23","v":0},{"$f":"AH45*'PV calculation'!AW$23","v":0},{"$f":"AI45*'PV calculation'!AX$23","v":0}]
[null,41,{"$f":"IF('Product benefit & adoption'!D51=\"\",\"\",'Product benefit & adoption'!D51)","v":""},{"$f":"IF('Product benefit & adoption'!F51=\"\",\"\",'Product benefit & adoption'!F51)","v":""},{"$f":"_xlfn.IFS('Product benefit & adoption'!$G$4=\"ALL\",SUM(F97:AI97),'Product benefit & adoption'!$G$4=\"2020-25\",SUM(K97:AI97),'Product benefit & adoption'!$G$4=\"2015-20\",SUM(F97:AD97))","v":0},{"$f":"F46*'PV calculation'!U$23","v":0},{"$f":"G46*'PV calculation'!V$23","v":0},{"$f":"H46*'PV calculation'!W$23","v":0},{"$f":"I46*'PV calculation'!X$23","v":0},{"$f":"J46*'PV calculation'!Y$23","v":0},{"$f":"K46*'PV calculation'!Z$23","v":0},{"$f":"L46*'PV calculation'!AA$23","v":0},{"$f":"M46*'PV calculation'!AB$23","v":0},{"$f":"N46*'PV calculation'!AC$23","v":0},{"$f":"O46*'PV calculation'!AD$23","v":0},{"$f":"P46*'PV calculation'!AE$23","v":0},{"$f":"Q46*'PV calculation'!AF$23","v":0},{"$f":"R46*'PV calculation'!AG$23","v":0},{"$f":"S46*'PV calculation'!AH$23","v":0},{"$f":"T46*'PV calculation'!AI$23","v":0},{"$f":"U46*'PV calculation'!AJ$23","v":0},{"$f":"V46*'PV calculation'!AK$23","v":0},{"$f":"W46*'PV calculation'!AL$23","v":0},{"$f":"X46*'PV calculation'!AM$23","v":0},{"$f":"Y46*'PV calculation'!AN$23","v":0},{"$f":"Z46*'PV calculation'!AO$23","v":0},{"$f":"AA46*'PV calculation'!AP$23","v":0},{"$f":"AB46*'PV calculation'!AQ$23","v":0},{"$f":"AC46*'PV calculation'!AR$23","v":0},{"$f":"AD46*'PV calculation'!AS$23","v":0},{"$f":"AE46*'PV calculation'!AT$23","v":0},{"$f":"AF46*'PV calculation'!AU$23","v":0},{"$f":"AG46*'PV calculation'!AV$23","v":0},{"$f":"AH46*'PV calculation'!AW$23","v":0},{"$f":"AI46*'PV calculation'!AX$23","v":0}]
[null,42,{"$f":"IF('Product benefit & adoption'!D52=\"\",\"\",'Product benefit & adoption'!D52)","v":""},{"$f":"IF('Product benefit & adoption'!F52=\"\",\"\",'Product benefit & adoption'!F52)","v":""},{"$f":"_xlfn.IFS('Product benefit & adoption'!$G$4=\"ALL\",SUM(F98:AI98),'Product benefit & adoption'!$G$4=\"2020-25\",SUM(K98:AI98),'Product benefit & adoption'!$G$4=\"2015-20\",SUM(F98:AD98))","v":0},{"$f":"F47*'PV calculation'!U$23","v":0},{"$f":"G47*'PV calculation'!V$23","v":0},{"$f":"H47*'PV calculation'!W$23","v":0},{"$f":"I47*'PV calculation'!X$23","v":0},{"$f":"J47*'PV calculation'!Y$23","v":0},{"$f":"K47*'PV calculation'!Z$23","v":0},{"$f":"L47*'PV calculation'!AA$23","v":0},{"$f":"M47*'PV calculation'!AB$23","v":0},{"$f":"N47*'PV calculation'!AC$23","v":0},{"$f":"O47*'PV calculation'!AD$23","v":0},{"$f":"P47*'PV calculation'!AE$23","v":0},{"$f":"Q47*'PV calculation'!AF$23","v":0},{"$f":"R47*'PV calculation'!AG$23","v":0},{"$f":"S47*'PV calculation'!AH$23","v":0},{"$f":"T47*'PV calculation'!AI$23","v":0},{"$f":"U47*'PV calculation'!AJ$23","v":0},{"$f":"V47*'PV calculation'!AK$23","v":0},{"$f":"W47*'PV calculation'!AL$23","v":0},{"$f":"X47*'PV calculation'!AM$23","v":0},{"$f":"Y47*'PV calculation'!AN$23","v":0},{"$f":"Z47*'PV calculation'!AO$23","v":0},{"$f":"AA47*'PV calculation'!AP$23","v":0},{"$f":"AB47*'PV calculation'!AQ$23","v":0},{"$f":"AC47*'PV calculation'!AR$23","v":0},{"$f":"AD47*'PV calculation'!AS$23","v":0},{"$f":"AE47*'PV calculation'!AT$23","v":0},{"$f":"AF47*'PV calculation'!AU$23","v":0},{"$f":"AG47*'PV calculation'!AV$23","v":0},{"$f":"AH47*'PV calculation'!AW$23","v":0},{"$f":"AI47*'PV calculation'!AX$23","v":0}]
[null,43,{"$f":"IF('Product benefit & adoption'!D53=\"\",\"\",'Product benefit & adoption'!D53)","v":""},{"$f":"IF('Product benefit & adoption'!F53=\"\",\"\",'Product benefit & adoption'!F53)","v":""},{"$f":"_xlfn.IFS('Product benefit & adoption'!$G$4=\"ALL\",SUM(F99:AI99),'Product benefit & adoption'!$G$4=\"2020-25\",SUM(K99:AI99),'Product benefit & adoption'!$G$4=\"2015-20\",SUM(F99:AD99))","v":0},{"$f":"F48*'PV calculation'!U$23","v":0},{"$f":"G48*'PV calculation'!V$23","v":0},{"$f":"H48*'PV calculation'!W$23","v":0},{"$f":"I48*'PV calculation'!X$23","v":0},{"$f":"J48*'PV calculation'!Y$23","v":0},{"$f":"K48*'PV calculation'!Z$23","v":0},{"$f":"L48*'PV calculation'!AA$23","v":0},{"$f":"M48*'PV calculation'!AB$23","v":0},{"$f":"N48*'PV calculation'!AC$23","v":0},{"$f":"O48*'PV calculation'!AD$23","v":0},{"$f":"P48*'PV calculation'!AE$23","v":0},{"$f":"Q48*'PV calculation'!AF$23","v":0},{"$f":"R48*'PV calculation'!AG$23","v":0},{"$f":"S48*'PV calculation'!AH$23","v":0},{"$f":"T48*'PV calculation'!AI$23","v":0},{"$f":"U48*'PV calculation'!AJ$23","v":0},{"$f":"V48*'PV calculation'!AK$23","v":0},{"$f":"W48*'PV calculation'!AL$23","v":0},{"$f":"X48*'PV calculation'!AM$23","v":0},{"$f":"Y48*'PV calculation'!AN$23","v":0},{"$f":"Z48*'PV calculation'!AO$23","v":0},{"$f":"AA48*'PV calculation'!AP$23","v":0},{"$f":"AB48*'PV calculation'!AQ$23","v":0},{"$f":"AC48*'PV calculation'!AR$23","v":0},{"$f":"AD48*'PV calculation'!AS$23","v":0},{"$f":"AE48*'PV calculation'!AT$23","v":0},{"$f":"AF48*'PV calculation'!AU$23","v":0},{"$f":"AG48*'PV calculation'!AV$23","v":0},{"$f":"AH48*'PV calculation'!AW$23","v":0},{"$f":"AI48*'PV calculation'!AX$23","v":0}]
[null,44,{"$f":"IF('Product benefit & adoption'!D54=\"\",\"\",'Product benefit & adoption'!D54)","v":""},{"$f":"IF('Product benefit & adoption'!F54=\"\",\"\",'Product benefit & adoption'!F54)","v":""},{"$f":"_xlfn.IFS('Product benefit & adoption'!$G$4=\"ALL\",SUM(F100:AI100),'Product benefit & adoption'!$G$4=\"2020-25\",SUM(K100:AI100),'Product benefit & adoption'!$G$4=\"2015-20\",SUM(F100:AD100))","v":0},{"$f":"F49*'PV calculation'!U$23","v":0},{"$f":"G49*'PV calculation'!V$23","v":0},{"$f":"H49*'PV calculation'!W$23","v":0},{"$f":"I49*'PV calculation'!X$23","v":0},{"$f":"J49*'PV calculation'!Y$23","v":0},{"$f":"K49*'PV calculation'!Z$23","v":0},{"$f":"L49*'PV calculation'!AA$23","v":0},{"$f":"M49*'PV calculation'!AB$23","v":0},{"$f":"N49*'PV calculation'!AC$23","v":0},{"$f":"O49*'PV calculation'!AD$23","v":0},{"$f":"P49*'PV calculation'!AE$23","v":0},{"$f":"Q49*'PV calculation'!AF$23","v":0},{"$f":"R49*'PV calculation'!AG$23","v":0},{"$f":"S49*'PV calculation'!AH$23","v":0},{"$f":"T49*'PV calculation'!AI$23","v":0},{"$f":"U49*'PV calculation'!AJ$23","v":0},{"$f":"V49*'PV calculation'!AK$23","v":0},{"$f":"W49*'PV calculation'!AL$23","v":0},{"$f":"X49*'PV calculation'!AM$23","v":0},{"$f":"Y49*'PV calculation'!AN$23","v":0},{"$f":"Z49*'PV calculation'!AO$23","v":0},{"$f":"AA49*'PV calculation'!AP$23","v":0},{"$f":"AB49*'PV calculation'!AQ$23","v":0},{"$f":"AC49*'PV calculation'!AR$23","v":0},{"$f":"AD49*'PV calculation'!AS$23","v":0},{"$f":"AE49*'PV calculation'!AT$23","v":0},{"$f":"AF49*'PV calculation'!AU$23","v":0},{"$f":"AG49*'PV calculation'!AV$23","v":0},{"$f":"AH49*'PV calculation'!AW$23","v":0},{"$f":"AI49*'PV calculation'!AX$23","v":0}]
[null,45,{"$f":"IF('Product benefit & adoption'!D55=\"\",\"\",'Product benefit & adoption'!D55)","v":""},{"$f":"IF('Product benefit & adoption'!F55=\"\",\"\",'Product benefit & adoption'!F55)","v":""},{"$f":"_xlfn.IFS('Product benefit & adoption'!$G$4=\"ALL\",SUM(F101:AI101),'Product benefit & adoption'!$G$4=\"2020-25\",SUM(K101:AI101),'Product benefit & adoption'!$G$4=\"2015-20\",SUM(F101:AD101))","v":0},{"$f":"F50*'PV calculation'!U$23","v":0},{"$f":"G50*'PV calculation'!V$23","v":0},{"$f":"H50*'PV calculation'!W$23","v":0},{"$f":"I50*'PV calculation'!X$23","v":0},{"$f":"J50*'PV calculation'!Y$23","v":0},{"$f":"K50*'PV calculation'!Z$23","v":0},{"$f":"L50*'PV calculation'!AA$23","v":0},{"$f":"M50*'PV calculation'!AB$23","v":0},{"$f":"N50*'PV calculation'!AC$23","v":0},{"$f":"O50*'PV calculation'!AD$23","v":0},{"$f":"P50*'PV calculation'!AE$23","v":0},{"$f":"Q50*'PV calculation'!AF$23","v":0},{"$f":"R50*'PV calculation'!AG$23","v":0},{"$f":"S50*'PV calculation'!AH$23","v":0},{"$f":"T50*'PV calculation'!AI$23","v":0},{"$f":"U50*'PV calculation'!AJ$23","v":0},{"$f":"V50*'PV calculation'!AK$23","v":0},{"$f":"W50*'PV calculation'!AL$23","v":0},{"$f":"X50*'PV calculation'!AM$23","v":0},{"$f":"Y50*'PV calculation'!AN$23","v":0},{"$f":"Z50*'PV calculation'!AO$23","v":0},{"$f":"AA50*'PV calculation'!AP$23","v":0},{"$f":"AB50*'PV calculation'!AQ$23","v":0},{"$f":"AC50*'PV calculation'!AR$23","v":0},{"$f":"AD50*'PV calculation'!AS$23","v":0},{"$f":"AE50*'PV calculation'!AT$23","v":0},{"$f":"AF50*'PV calculation'!AU$23","v":0},{"$f":"AG50*'PV calculation'!AV$23","v":0},{"$f":"AH50*'PV calculation'!AW$23","v":0},{"$f":"AI50*'PV calculation'!AX$23","v":0}]
[null,46,{"$f":"IF('Product benefit & adoption'!D56=\"\",\"\",'Product benefit & adoption'!D56)","v":""},{"$f":"IF('Product benefit & adoption'!F56=\"\",\"\",'Product benefit & adoption'!F56)","v":""},{"$f":"_xlfn.IFS('Product benefit & adoption'!$G$4=\"ALL\",SUM(F102:AI102),'Product benefit & adoption'!$G$4=\"2020-25\",SUM(K102:AI102),'Product benefit & adoption'!$G$4=\"2015-20\",SUM(F102:AD102))","v":0},{"$f":"F51*'PV calculation'!U$23","v":0},{"$f":"G51*'PV calculation'!V$23","v":0},{"$f":"H51*'PV calculation'!W$23","v":0},{"$f":"I51*'PV calculation'!X$23","v":0},{"$f":"J51*'PV calculation'!Y$23","v":0},{"$f":"K51*'PV calculation'!Z$23","v":0},{"$f":"L51*'PV calculation'!AA$23","v":0},{"$f":"M51*'PV calculation'!AB$23","v":0},{"$f":"N51*'PV calculation'!AC$23","v":0},{"$f":"O51*'PV calculation'!AD$23","v":0},{"$f":"P51*'PV calculation'!AE$23","v":0},{"$f":"Q51*'PV calculation'!AF$23","v":0},{"$f":"R51*'PV calculation'!AG$23","v":0},{"$f":"S51*'PV calculation'!AH$23","v":0},{"$f":"T51*'PV calculation'!AI$23","v":0},{"$f":"U51*'PV calculation'!AJ$23","v":0},{"$f":"V51*'PV calculation'!AK$23","v":0},{"$f":"W51*'PV calculation'!AL$23","v":0},{"$f":"X51*'PV calculation'!AM$23","v":0},{"$f":"Y51*'PV calculation'!AN$23","v":0},{"$f":"Z51*'PV calculation'!AO$23","v":0},{"$f":"AA51*'PV calculation'!AP$23","v":0},{"$f":"AB51*'PV calculation'!AQ$23","v":0},{"$f":"AC51*'PV calculation'!AR$23","v":0},{"$f":"AD51*'PV calculation'!AS$23","v":0},{"$f":"AE51*'PV calculation'!AT$23","v":0},{"$f":"AF51*'PV calculation'!AU$23","v":0},{"$f":"AG51*'PV calculation'!AV$23","v":0},{"$f":"AH51*'PV calculation'!AW$23","v":0},{"$f":"AI51*'PV calculation'!AX$23","v":0}]
[null,null,"Net present value of first round benefits in baseline year dollars at 5 per cent discount rate",null,{"$f":"SUM(E57:E102)","v":150.0441851203193},{"$f":"SUM(F57:F102)","v":0},{"$f":"SUM(G57:G102)","v":0},0,0,0,0.33075000000000004,1.155,{"$f":"SUM(M57:M102)","v":2.2000000000000002},5.0476190476190474,4.9886621315192743,4.9238743116294126,4.936214848751292,5.484683165279213,5.8951016334293582,6.2539957051450692,6.565341811678266,6.8328545119086517,7.0600024157187322,7.3084911135804678,7.5173051453970539,7.6896595843567717,7.8285532714305424,7.9367821185010081,8.0169516348495033,8.0714887208008594,7.4793717876146966,7.1232112262997109,6.7840106917140108,6.4609625635371533,6.153297679559194]

{"sheet":"PV calculation","index":4,"n_rows":30,"n_cols":55,"rows_kept":30,"cut":false,"hidden":false,"merged":[[28,1,28,10],[1,1,1,6],[27,1,27,10]]}
["H"]
[null,"Discounting adjustments to obtain net present value values of cash streams (in both nominal or real terms)"]
[]
[null,null,null,"1998-99","1999-2000","2000-01","2001-02","2002-03","2003-04","2004-05","2005-06","2006-07","2007-08","2008-09","2009-10","2010-11","2011-12","2012-13","2013-14","2014-15","2015-16","2016-17","2017-18","2018-19","2019-20","2020-21","2021-22","2022-23","2023-24","2024-25","2025-26","2026-27","2027-28","2028-29","2029-30","2030-31","2031-32","2032-33","2033-34","2034-35","2035-36","2036-37","2037-38","3038-39","2039-40","2040-41","2041-42","2042-43","2043-44","2044-45","2045-46","2046-47","2047-48","2048-49","2049-50"]
[null,"Year",null,"FY 1999","FY 2000","FY 2001","FY 2002","FY 2003","FY 2004","FY 2005","FY 2006","FY 2007","FY 2008","FY 2009","FY 2010","FY 2011","FY 2012","FY 2013","FY 2014","FY 2015","FY 2016","FY 2017","FY 2018","FY 2019","FY 2020","FY 2021","FY 2022","FY 2023","FY 2024","FY 2025","FY 2026","FY 2027","FY 2028","FY 2029","FY 2030","FY 2031","FY 2032","FY 2033","FY 2034","FY 2035","FY 2036","FY 2037","FY 2038","FY 2039","FY 2040","FY 2041","FY 2042","FY 2043","FY 2044","FY 2045","FY 2045","FY 2045","FY 2045","FY 2045","FY 2045"]
[]
[null,"ROI project"]
[null," - Difference from 2023 base",null,{"$f":"E8-1","v":-24},-23,-22,-21,-20,-19,-18,-17,-16,-15,-14,-13,-12,-11,-10,-9,-8,-7,-6,-5,-4,-3,-2,-1,0,{"$f":"AB8+1","v":1},2,3,4,5,6,7,8,9,10,11,12,13,14,15,16,17,18,19,20,21,22,23,24,25,26,27]
[]
[null,"ABARES Commodity Statistical Bulletin and Australian Commodities (1998-99 to 2021-22)"]
[null,"% CPI","%",null,{"$f":"(E12-D12)/D12*100","v":2.3967551622418881},6.0136838314728092,2.8532608695652293,3.0052840158520362,2.4046168643796091,2.4107701941139781,3.2100275145215531,2.9620853080568716,3.3659378596087421,3.1171722794322259,2.321187584345485,3.1126351886045773,2.3023791250959325,2.2755688922230615,2.7139364303178541,1.7138776481790023,1.3807629300257376,1.7082179132040707,1.929187471629596,1.6477399242930253,1.3362541073384497,1.6212710765239946,4.4458625824292657]
[null,"CPI indexb","2011-12=100",67.8,69.424999999999997,73.599999999999994,75.7,77.974999999999994,79.849999999999994,81.775000000000006,84.4,86.9,89.825000000000003,92.625,94.775000000000006,97.724999999999994,99.974999999999994,102.25,105.02500000000001,106.825,108.3,110.15,112.27500000000001,114.125,115.65,117.52500000000001,122.75]
[]
[null,"DAWE Agricultural commodities March 2023","%",null,null,null,null,null,null,null,null,null,null,null,null,null,null,null,null,null,null,null,null,null,null,1.629,4.4249999999999998,7.2809999999999997,4.5309999999999997,3.1880000000000002,2.5,2.5,2.5,2.5,2.5,2.5,2.5,2.5,2.5,2.5,2.5,2.5,2.5,2.5,2.5,2.5,2.5,2.5,2.5,2.5,2.5,2.5,2.5,2.5,2.5]
[]
[null,"Inflation/Consumer price index"]
[null,"% CPI","%",null,{"$f":"E11","v":2.3967551622418881},6.0136838314728092,2.8532608695652293,3.0052840158520362,2.4046168643796091,2.4107701941139781,3.2100275145215531,2.9620853080568716,3.3659378596087421,3.1171722794322259,2.321187584345485,3.1126351886045773,2.3023791250959325,2.2755688922230615,2.7139364303178541,1.7138776481790023,1.3807629300257376,1.7082179132040707,1.929187471629596,1.6477399242930253,1.3362541073384497,{"$f":"Z14","v":1.629},{"$f":"AA14","v":4.4249999999999998},7.2809999999999997,4.5309999999999997,3.1880000000000002,2.5,2.5,{"$f":"$AF17","v":2.5},{"$f":"$AF17","v":2.5},2.5,2.5,2.5,2.5,2.5,2.5,2.5,2.5,2.5,2.5,2.5,2.5,2.5,2.5,2.5,2.5,2.5,2.5,2.5,2.5,2.5]
[null,"CPI index","2011-12=100",{"$f":"D12","v":67.8},{"$f":"D18*(1+E17/100)","v":69.424999999999997},{"$f":"E18*(1+F17/100)","v":73.599999999999994},75.7,77.974999999999994,79.849999999999994,81.775000000000006,84.4,86.899999999999991,89.824999999999989,92.624999999999986,94.774999999999977,97.724999999999966,99.974999999999952,102.24999999999996,105.02499999999996,106.82499999999996,108.29999999999995,110.14999999999998,112.27499999999998,114.12499999999999,115.64999999999998,117.53393849999996,122.73481527862495,131.67113717906165,137.63715640464491,142.02502895082498,145.5756546745956,149.21504604146048,152.94542219249698,156.76905774730938,160.68828419099211,164.7054912957669,168.82312857816106,173.04370679261507,177.36979946243042,181.80404444899116,186.34914556021593,191.00787419922131,195.78307105420183,200.67764783055685,205.69458902632076,210.83695375197877,216.10787759577821,221.51057453567265,227.04833889906445,232.72454737154104,238.54266105582954,244.50622758222525,250.61888327178087,256.88435535357536,263.30646423741473]
[null," - CPI Adjustment based-on 2023 base prices for PBCS",null,null,{"$f":"$AB$18/E18","v":1.8965954220966748},{"$f":"$AB$18/F18","v":1.7890100160198594},1.7393809402782252,1.6886327307350004,1.6489810542149237,1.6101637074785893,1.5600845637329577,1.5152029594828729,1.4658629243424621,1.4215507387752946,1.3893024234139981,1.3473639005276203,1.3170406319486043,1.2877372829248088,1.2537123273416966,1.2325872892961545,1.2157999739525549,1.1953802739814949,1.1727556194973205,1.1537449040881635,1.138531233714325,1.1202818425000001,1.07281,1,0.95665400694530822,0.92709811891431981,0.90448596967250716,0.88242533626586062,0.86090276708864466,0.83990513862306804,0.81941964743713958,0.79943380237769723,0.77993541695385105,0.76091260190619614,0.74235375795726466,0.72424756873879492,0.70658299389150725,0.68934926233317784,0.67253586569090529,0.65613255189356623,0.64012931892055247,0.62451640870297798,0.60928430117363719,0.59442370846208503,0.57992556923130256,0.56578104315249034,0.55198150551462477,0.53851854196548765,0.52538394338096361,0.51256970085947673,0.50006800083851388]
[]
[null,"Discount rate"]
[null,"CRDC rate in real terms a",0.05]
[null," - Adjustment based-on FY2023 baseline",null,{"$f":"1/((1+$C22)^D$8)","v":3.2250999437137002},3.0715237559178106,2.9252607199217238,2.7859625904016418,2.6532977051444209,2.526950195375639,2.4066192336910848,2.2920183178010332,2.182874588381936,2.0789281794113679,1.9799315994393973,1.8856491423232362,1.7958563260221292,1.7103393581163138,1.6288946267774416,1.5513282159785158,1.4774554437890626,1.4071004226562502,1.340095640625,1.2762815625000001,1.21550625,1.1576250000000001,1.1025,1.05,1,0.95238095238095233,0.90702947845804982,0.86383759853147601,0.82270247479188197,0.78352616646845896,0.74621539663662761,0.71068133013012147,0.67683936202868722,0.64460891621779726,0.61391325354075932,0.5846792890864374,0.5568374181775595,0.53032135064529462,0.50506795299551888,0.48101709809097021,0.45811152199140021,0.43629668761085727,0.41552065486748313,0.39573395701665059,0.37688948287300061,0.35894236464095297,0.3418498710866219,0.32557130579678267,0.31006791028265024,0.29530277169776209,0.28124073495024959,0.2678483190002377]
[]
[null,"Adjustment for series in nominal terms (CPI+CRDC rate) for investment costs"]
[null," - Multiply series by adjustment to obtain NPV in FY2023 dollar terms",null,null,{"$f":"E23*E19","v":5.8254378943349039},{"$f":"F23*F19","v":5.2333207274094287},4.8458502300727675,4.4804453492909335,4.1668929971191284,3.8750509478093185,3.5757423973945723,3.3074980364962676,3.0474237405698985,2.8145732279076259,2.6197369231381993,2.4196719842163779,2.2525864290600803,2.0975883408572034,1.9449193081252671,1.8210928005158076,1.7107526572140981,1.6019238940517195,1.4967663744826958,1.4023841418248133,1.3179922194285456,1.2351107313562502,1.1264505,1,0.9110990542336268,0.84090532327829459,0.78132898794731198,0.72597350796498217,0.67453984479905438,0.62675014615475444,0.58234624497538157,0.54108826478548822,0.50275332384249771,0.46713433109639746,0.43403886745309872,0.40328814629788512,0.37471604766354011,0.34816822082558907,0.32350125047673778,0.300581881976063,0.27928630148763112,0.25949946711975014,0.24111448745156813,0.22403204408972652,0.20815985513563443,0.19341217666493329,0.17970933952607038,0.16697731895569845,0.15514733468589867,0.14415547938294881,0.13394237341040541]
[]
[null,"a. Sourced from DAWE Agricultural Commodities March 2023 and Council of Rural Research and Development Corporations Impact Assessment Guidelines, May 2014 "]
[]
[null,"Updated 6 June 2023 by Derek Quirke CIE"]

{"sheet":"Formatting","index":5,"n_rows":51,"n_cols":6,"rows_kept":51,"cut":false,"hidden":false,"merged":[]}
["H"]
[]
[]
[]
[]
[null,null,"Excel Format","Style Name","Comment","Example"]
[]
[null,null,null,"Data Entry %","Data entry of  % - Primary data entry fields (255 +204 + 153)",0.18]
[null,null,null,"Data Entry No","Data entry of numbers - Primary data entry fields (255 +204 + 153)",-23000]
[null,null,null,"Data Entry $","Data entry of  $ - Primary data entry fields (255 +204 + 153)",-23000]
[null,null,null,"Fixed $","Fixed $ data - constants",100]
[null,null,null,"Fixed Date","Fixed date data - constants","2020-06-26"]
[null,null,null,"Fixed No","Fixed number data - constants",4500]
[null,null,null,"Fixed Text","Fixed text data - constants & descriptor text. ","Levy amount"]
[null,null,null,"Formula $","Calculations and references within the one model. Amount displayed as a $ value.",{"$f":"5*6","v":30}]
[null,null,null,"Formula No","Calculations and references within the one model. Amount displayed as a number. ",{"$f":"5000*56","v":280000}]
[null,null,null,"Formula Text","Calculations and references within the one model. Amount displayed is a text. ",{"$f":"_xlfn.CONCAT(\"A\",\"B\")","v":"AB"}]
[null,null,null,"External Link No","References to separate files or external links. Blue underlined text",4500]
[null,null,null,"External Link $","References to separate files or external links. Blue underlined text with $ sign",4500]
[null,null,null,"External Link %","References to separate files or external links. Blue underlined text with % sign",0.45]
[null,null,null,"HomePage","Link to Home page - very first page. Optional.","1. Contents"]
[null,null,null,"MLA Check Cell","Check to ensure calculations are adding up etc (165 + 165 +165)",100]
[null,null,null,"MLA Heading","Bold + MLA Green 100% (0 + 117 + 73) + centre and middle aligned + white text + wrap","Total Return to MLA of all Projects"]
[null,null,null,"MLA Sub Heading","Bold + MLA Green 55% (115 + 179 + 155) + centre and middle aligned + white text + wrap","2020-21"]
[null,null,null,"Total","Sum of a particular item",4567000]
[null,null,null,"MLA Note","Notes and comments (255 + 255 + 204)","This is a note"]
[null,null,null,"Warning","Warning text","This is a warning"]
[]
[]
[null,null,null,"Text font: ","Calibri"]
[null,null,null,"Text size: ","10 standard, 11 for total"]
[null,null,null,"Text alignment:","Top + left"]
[]
[null,null,null,"Number font:","Calibri"]
[null,null,null,"Number size:","10 standard, 11 for total"]
[null,null,null,"Number alignment:","Top + right"]
[null,null,null,"Number format:","_(* #,##0.0_);_(* (#,##0.0);_(* \"-\"??_);_(@_)"]
[null,null,null,"Decimal place:","1 decimal place (default) but change as required"]
[null,null,null,"Negative no:","Brackets"]
[null,null,null,"Zero number","Hyphen"]
[null,null,null,null,null,0]
[null,null,"Grid Lines:",null,"Totals (bold face, bold overline,11 Text size, blue if formula)",117]
[null,null,null,null,null,73]
[null,null,"Tab naming","Use default black text/hight on white background",null,"white text"]
[null,null,null,null,"Primary data entry tab background colour"]
[null,null,null,"Numbering of tabs","Optional. Only required for complex spreadsheets"]
[null,null,null,"Grouping tab (empty)","Optional. Only required for complex spreadsheets to space different types of tabs. Dark green colour ( 0, 117, 73) nd white text."]
[]
[null,null,"Other","- Always have the first column and first row empty on each of the tabs. Column width: 1.55 + row height: 12"]
[null,null,null,"- There are no prescribed rules for other columns width and row height. Just need to ensure they are consistent on the same table"]
[null,null,null,"- Formatting rules based on minimal change to default MS Excel format + minimal data entry user effort"]