{"text_format":"1","workbook":"xlsx","n_sheets":6,"sheets":["Examples","Read Me 1st","Product benefit & adoption","Net benefits $m by product","PV calculation","Formatting"],"not_rendered":{"charts":15,"images":1,"macros":1,"external_links":0,"defined_names":1,"comments":4,"pivot_tables":0},"unopened":[],"bounds":{"document_bytes":16777216,"sheet_cells":100000,"rows_first":2000,"rows_last":500,"rows_between":2000,"halvings":0,"cell_chars":16384,"cell_head_chars":4096},"cells_cut":0,"cells_raw":0,"read":"whole","date_system":"1900"}

{"sheet":"Examples","index":0,"n_rows":22,"n_cols":27,"rows_kept":22,"cut":false,"hidden":true,"merged":[]}
[null,"Teal","Red","Light grey","Mid-grey","Grey","Light teal","Mid-red","Light red",null,null,"Teal solid","Red  solid","Mid-grey","Teal dashes","Red  dashes","Grey dashes",null,"X value","1st Y value","2nd Y value",null,null,"Teal","Red","Mid-red","Mid-grey"]
["2003-04",36.19,36.880000000000003,21.56,5.36,3.01,10,3.01,10,null,"2003-04",33.19,36.880000000000003,21.56,5.36,3.01,10,null,1.8,10,17,null,"2003-04",33.19,36.880000000000003,21.56,5.36]
["2004-05",39.39,32.020000000000003,21.6,7.01,3.36,12,3.36,12,null,"2004-05",39.39,32.020000000000003,21.6,7.01,3.36,12,null,2.2999999999999998,12,9,null,"2004-05",39.39,32.020000000000003,21.6,7.01]
["2005-06",42.78,29.91,18.350000000000001,6.33,2.63,14,2.63,14,null,"2005-06",42.78,29.91,18.350000000000001,6.33,2.63,14,null,3.7,16,14,null,"2005-06",42.78,29.91,18.350000000000001,6.33]
["2006-07",42.13,26.53,21.6,7.01,2.72,16,2.72,16,null,"2006-07",42.13,26.53,21.6,7.01,2.72,16,null,4.0999999999999996,8,23,null,"2006-07",42.13,26.53,21.6,7.01]
["2007-08",41.69,24.76,23.98,7,2.57,18,2.57,18,null,"2007-08",41.69,24.76,23.98,7,2.57,18,null,5.5,14,27,null,"2007-08",41.69,24.76,23.98,7]
{"$rows_left_out":17}
{"sheet":"Read Me 1st","index":1,"n_rows":19,"n_cols":6,"rows_kept":19,"cut":false,"hidden":false,"merged":[[8,5,8,10]]}
[]
[null,"Title","MLA Product Adoption and Impact Template"]
[null,"MLA sub program"]
[null,"Program manager"]
[null,"Prepared by","George Waldthausen"]
[null,"Reviewed by","George Waldthausen"]
{"$rows_left_out":14}
{"sheet":"Product benefit & adoption","index":2,"n_rows":93,"n_cols":56,"rows_kept":93,"cut":false,"hidden":false,"merged":[[8,16,8,17],[8,18,8,20],[8,21,8,24],[8,26,8,55],[1,1,1,6],[6,10,6,14],[6,16,6,24]]}
["H"]
[null,"Benefits and adoption by product: allocation between type of benefit and species"]
[]
[null,null,"NPV Base year","FY23",null,"Select impact time period","ALL","Options:"]
[null,null,"Time period",{"$f":"$G$4","v":"ALL"},null,null,null,"2015-20"]
[null,null,"Sector receiving initial impact (shock)","Producer",null,null,null,"2020-25"]
{"$rows_left_out":88}
{"sheet":"Net benefits $m by product","index":3,"n_rows":103,"n_cols":35,"rows_kept":103,"cut":false,"hidden":false,"merged":[[51,2,51,3],[102,2,102,3],[1,1,1,6]]}
["H"]
[null,"Time series of net benefits from  investments"]
[null,null,"Time period",{"$f":"'Product benefit & adoption'!G4","v":"ALL"}]
[null,"Item","Product Category","Product (value proposition, extension program etc)",{"$f":"\"SUM Period (non PV):\"&\" \"&TEXT('Product benefit & adoption'!$G$4,2)","v":"SUM Period (non PV): ALL"},"2015-16","2016-17","2017-18","2018-19","2019-20","2020-21","2021-22","2022-23","2023-24","2024-25","2025-26","2026-27","2027-28","2028-29","2029-30","2030-31","2031-32","2032-33","2033-34","2034-35","2035-36","2036-37","2037-38","2038-39","2039-40","2040-41","2041-42","2042-43","2043-44","2044-45"]
[null,null,null,null,"$m","$m","$m","$m","$m","$m","$m","$m","$m","$m","$m","$m","$m","$m","$m","$m","$m","$m","$m","$m","$m","$m","$m","$m","$m","$m","$m","$m","$m","$m","$m"]
[null,1,{"$f":"IF('Product benefit & adoption'!D11=\"\",\"\",'Product benefit & adoption'!D11)","v":"Pasture variety"},{"$f":"IF('Product benefit & adoption'!F11=\"\",\"\",'Product benefit & adoption'!F11)","v":"e.g Tropical pastures into  temperate zone\n\n"},{"$f":"_xlfn.IFS('Product benefit & adoption'!$G$4=\"ALL\",SUM(F6:AI6),'Product benefit & adoption'!$G$4=\"2020-25\",SUM(K6:AI6),'Product benefit & adoption'!$G$4=\"2015-20\",SUM(F6:AD6))","v":10.899999999999999},{"$f":"_xlfn.IFS('Product benefit & adoption'!$G$4=\"ALL\",'Product benefit & adoption'!AA11*'Product benefit & adoption'!$P11/1000000,'Product benefit & adoption'!$G$4=\"2020-25\",'Product benefit & adoption'!AA11*'Product benefit & adoption'!$N11/1000000,'Product benefit & adoption'!$G$4=\"2015-20\",'Product benefit & adoption'!AA11*'Product benefit & adoption'!$L11/1000000)","v":0},{"$f":"_xlfn.IFS('Product benefit & adoption'!$G$4=\"ALL\",'Product benefit & adoption'!AB11*'Product benefit & adoption'!$P11/1000000,'Product benefit & adoption'!$G$4=\"2020-25\",'Product benefit & adoption'!AB11*'Product benefit & adoption'!$N11/1000000,'Product benefit & adoption'!$G$4=\"2015-20\",'Product benefit & adoption'!AB11*'Product benefit & adoption'!$L11/1000000)","v":0},{"$f":"_xlfn.IFS('Product benefit & adoption'!$G$4=\"ALL\",'Product benefit & adoption'!AC11*'Product benefit & adoption'!$P11/1000000,'Product benefit & adoption'!$G$4=\"2020-25\",'Product benefit & adoption'!AC11*'Product benefit & adoption'!$N11/1000000,'Product benefit & adoption'!$G$4=\"2015-20\",'Product benefit & adoption'!AC11*'Product benefit & adoption'!$L11/1000000)","v":0},{"$f":"_xlfn.IFS('Product benefit & adoption'!$G$4=\"ALL\",'Product benefit & adoption'!AD11*'Product benefit & adoption'!$P11/1000000,'Product benefit & adoption'!$G$4=\"2020-25\",'Product benefit & adoption'!AD11*'Product benefit & adoption'!$N11/1000000,'Product benefit & adoption'!$G$4=\"2015-20\",'Product benefit & adoption'!AD11*'Product benefit & adoption'!$L11/1000000)","v":0},{"$f":"_xlfn.IFS('Product benefit & adoption'!$G$4=\"ALL\",'Product benefit & adoption'!AE11*'Product benefit & adoption'!$P11/1000000,'Product benefit & adoption'!$G$4=\"2020-25\",'Product benefit & adoption'!AE11*'Product benefit & adoption'!$N11/1000000,'Product benefit & adoption'!$G$4=\"2015-20\",'Product benefit & adoption'!AE11*'Product benefit & adoption'!$L11/1000000)","v":0},{"$f":"_xlfn.IFS('Product benefit & adoption'!$G$4=\"ALL\",'Product benefit & adoption'!AF11*'Product benefit & adoption'!$P11/1000000,'Product benefit & adoption'!$G$4=\"2020-25\",'Product benefit & adoption'!AF11*'Product benefit & adoption'!$N11/1000000,'Product benefit & adoption'!$G$4=\"2015-20\",'Product benefit & adoption'!AF11*'Product benefit & adoption'!$L11/1000000)","v":0.1},{"$f":"_xlfn.IFS('Product benefit & adoption'!$G$4=\"ALL\",'Product benefit & adoption'!AG11*'Product benefit & adoption'!$P11/1000000,'Product benefit & adoption'!$G$4=\"2020-25\",'Product benefit & adoption'!AG11*'Product benefit & adoption'!$N11/1000000,'Product benefit & adoption'!$G$4=\"2015-20\",'Product benefit & adoption'!AG11*'Product benefit & adoption'!$L11/1000000)","v":0.1},{"$f":"_xlfn.IFS('Product benefit & adoption'!$G$4=\"ALL\",'Product benefit & adoption'!AH11*'Product benefit & adoption'!$P11/1000000,'Product benefit & adoption'!$G$4=\"2020-25\",'Product benefit & adoption'!AH11*'Product benefit & adoption'!$N11/1000000,'Product benefit & adoption'!$G$4=\"2015-20\",'Product benefit & adoption'!AH11*'Product benefit & adoption'!$L11/1000000)","v":0.2},{"$f":"_xlfn.IFS('Product benefit & adoption'!$G$4=\"ALL\",'Product benefit & adoption'!AI11*'Product benefit & adoption'!$P11/1000000,'Product benefit & adoption'!$G$4=\"2020-25\",'Product benefit & adoption'!AI11*'Product benefit & adoption'!$N11/1000000,'Product benefit & adoption'!$G$4=\"2015-20\",'Product benefit & adoption'!AI11*'Product benefit & adoption'!$L11/1000000)","v":0.3},{"$f":"_xlfn.IFS('Product benefit & adoption'!$G$4=\"ALL\",'Product benefit & adoption'!AJ11*'Product benefit & adoption'!$P11/1000000,'Product benefit & adoption'!$G$4=\"2020-25\",'Product benefit & adoption'!AJ11*'Product benefit & adoption'!$N11/1000000,'Product benefit & adoption'!$G$4=\"2015-20\",'Product benefit & adoption'!AJ11*'Product benefit & adoption'!$L11/1000000)","v":0.5},{"$f":"_xlfn.IFS('Product benefit & adoption'!$G$4=\"ALL\",'Product benefit & adoption'!AK11*'Product benefit & adoption'!$P11/1000000,'Product benefit & adoption'!$G$4=\"2020-25\",'Product benefit & adoption'!AK11*'Product benefit & adoption'!$N11/1000000,'Product benefit & adoption'!$G$4=\"2015-20\",'Product benefit & adoption'!AK11*'Product benefit & adoption'!$L11/1000000)","v":0.7},{"$f":"_xlfn.IFS('Product benefit & adoption'!$G$4=\"ALL\",'Product benefit & adoption'!AL11*'Product benefit & adoption'!$P11/1000000,'Product benefit & adoption'!$G$4=\"2020-25\",'Product benefit & adoption'!AL11*'Product benefit & adoption'!$N11/1000000,'Product benefit & adoption'!$G$4=\"2015-20\",'Product benefit & adoption'!AL11*'Product benefit & adoption'!$L11/1000000)","v":1},{"$f":"_xlfn.IFS('Product benefit & adoption'!$G$4=\"ALL\",'Product benefit & adoption'!AM11*'Product benefit & adoption'!$P11/1000000,'Product benefit & adoption'!$G$4=\"2020-25\",'Product benefit & adoption'!AM11*'Product benefit & adoption'!$N11/1000000,'Product benefit & adoption'!$G$4=\"2015-20\",'Product benefit & adoption'!AM11*'Product benefit & adoption'!$L11/1000000)","v":1},{"$f":"_xlfn.IFS('Product benefit & adoption'!$G$4=\"ALL\",'Product benefit & adoption'!AN11*'Product benefit & adoption'!$P11/1000000,'Product benefit & adoption'!$G$4=\"2020-25\",'Product benefit & adoption'!AN11*'Product benefit & adoption'!$N11/1000000,'Product benefit & adoption'!$G$4=\"2015-20\",'Product benefit & adoption'!AN11*'Product benefit & adoption'!$L11/1000000)","v":0.9},{"$f":"_xlfn.IFS('Product benefit & adoption'!$G$4=\"ALL\",'Product benefit & adoption'!AO11*'Product benefit & adoption'!$P11/1000000,'Product benefit & adoption'!$G$4=\"2020-25\",'Product benefit & adoption'!AO11*'Product benefit & adoption'!$N11/1000000,'Product benefit & adoption'!$G$4=\"2015-20\",'Product benefit & adoption'!AO11*'Product benefit & adoption'!$L11/1000000)","v":0.8},{"$f":"_xlfn.IFS('Product benefit & adoption'!$G$4=\"ALL\",'Product benefit & adoption'!AP11*'Product benefit & adoption'!$P11/1000000,'Product benefit & adoption'!$G$4=\"2020-25\",'Product benefit & adoption'!AP11*'Product benefit & adoption'!$N11/1000000,'Product benefit & adoption'!$G$4=\"2015-20\",'Product benefit & adoption'!AP11*'Product benefit & adoption'!$L11/1000000)","v":0.7},{"$f":"_xlfn.IFS('Product benefit & adoption'!$G$4=\"ALL\",'Product benefit & adoption'!AQ11*'Product benefit & adoption'!$P11/1000000,'Product benefit & adoption'!$G$4=\"2020-25\",'Product benefit & adoption'!AQ11*'Product benefit & adoption'!$N11/1000000,'Product benefit & adoption'!$G$4=\"2015-20\",'Product benefit & adoption'!AQ11*'Product benefit & adoption'!$L11/1000000)","v":0.6},{"$f":"_xlfn.IFS('Product benefit & adoption'!$G$4=\"ALL\",'Product benefit & adoption'!AR11*'Product benefit & adoption'!$P11/1000000,'Product benefit & adoption'!$G$4=\"2020-25\",'Product benefit & adoption'!AR11*'Product benefit & adoption'!$N11/1000000,'Product benefit & adoption'!$G$4=\"2015-20\",'Product benefit & adoption'!AR11*'Product benefit & adoption'!$L11/1000000)","v":0.5},{"$f":"_xlfn.IFS('Product benefit & adoption'!$G$4=\"ALL\",'Product benefit & adoption'!AS11*'Product benefit & adoption'!$P11/1000000,'Product benefit & adoption'!$G$4=\"2020-25\",'Product benefit & adoption'!AS11*'Product benefit & adoption'!$N11/1000000,'Product benefit & adoption'!$G$4=\"2015-20\",'Product benefit & adoption'!AS11*'Product benefit & adoption'!$L11/1000000)","v":0.5},{"$f":"_xlfn.IFS('Product benefit & adoption'!$G$4=\"ALL\",'Product benefit & adoption'!AT11*'Product benefit & adoption'!$P11/1000000,'Product benefit & adoption'!$G$4=\"2020-25\",'Product benefit & adoption'!AT11*'Product benefit & adoption'!$N11/1000000,'Product benefit & adoption'!$G$4=\"2015-20\",'Product benefit & adoption'!AT11*'Product benefit & adoption'!$L11/1000000)","v":0.5},{"$f":"_xlfn.IFS('Product benefit & adoption'!$G$4=\"ALL\",'Product benefit & adoption'!AU11*'Product benefit & adoption'!$P11/1000000,'Product benefit & adoption'!$G$4=\"2020-25\",'Product benefit & adoption'!AU11*'Product benefit & adoption'!$N11/1000000,'Product benefit & adoption'!$G$4=\"2015-20\",'Product benefit & adoption'!AU11*'Product benefit & adoption'!$L11/1000000)","v":0.5},{"$f":"_xlfn.IFS('Product benefit & adoption'!$G$4=\"ALL\",'Product benefit & adoption'!AV11*'Product benefit & adoption'!$P11/1000000,'Product benefit & adoption'!$G$4=\"2020-25\",'Product benefit & adoption'!AV11*'Product benefit & adoption'!$N11/1000000,'Product benefit & adoption'!$G$4=\"2015-20\",'Product benefit & adoption'!AV11*'Product benefit & adoption'!$L11/1000000)","v":0.5},{"$f":"_xlfn.IFS('Product benefit & adoption'!$G$4=\"ALL\",'Product benefit & adoption'!AW11*'Product benefit & adoption'!$P11/1000000,'Product benefit & adoption'!$G$4=\"2020-25\",'Product benefit & adoption'!AW11*'Product benefit & adoption'!$N11/1000000,'Product benefit & adoption'!$G$4=\"2015-20\",'Product benefit & adoption'!AW11*'Product benefit & adoption'!$L11/1000000)","v":0.5},{"$f":"_xlfn.IFS('Product benefit & adoption'!$G$4=\"ALL\",'Product benefit & adoption'!AX11*'Product benefit & adoption'!$P11/1000000,'Product benefit & adoption'!$G$4=\"2020-25\",'Product benefit & adoption'!AX11*'Product benefit & adoption'!$N11/1000000,'Product benefit & adoption'!$G$4=\"2015-20\",'Product benefit & adoption'!AX11*'Product benefit & adoption'!$L11/1000000)","v":0.5},{"$f":"_xlfn.IFS('Product benefit & adoption'!$G$4=\"ALL\",'Product benefit & adoption'!AY11*'Product benefit & adoption'!$P11/1000000,'Product benefit & adoption'!$G$4=\"2020-25\",'Product benefit & adoption'!AY11*'Product benefit & adoption'!$N11/1000000,'Product benefit & adoption'!$G$4=\"2015-20\",'Product benefit & adoption'!AY11*'Product benefit & adoption'!$L11/1000000)","v":0.5},{"$f":"_xlfn.IFS('Product benefit & adoption'!$G$4=\"ALL\",'Product benefit & adoption'!AZ11*'Product benefit & adoption'!$P11/1000000,'Product benefit & adoption'!$G$4=\"2020-25\",'Product benefit & adoption'!AZ11*'Product benefit & adoption'!$N11/1000000,'Product benefit & adoption'!$G$4=\"2015-20\",'Product benefit & adoption'!AZ11*'Product benefit & adoption'!$L11/1000000)","v":0},{"$f":"_xlfn.IFS('Product benefit & adoption'!$G$4=\"ALL\",'Product benefit & adoption'!BA11*'Product benefit & adoption'!$P11/1000000,'Product benefit & adoption'!$G$4=\"2020-25\",'Product benefit & adoption'!BA11*'Product benefit & adoption'!$N11/1000000,'Product benefit & adoption'!$G$4=\"2015-20\",'Product benefit & adoption'!BA11*'Product benefit & adoption'!$L11/1000000)","v":0},{"$f":"_xlfn.IFS('Product benefit & adoption'!$G$4=\"ALL\",'Product benefit & adoption'!BB11*'Product benefit & adoption'!$P11/1000000,'Product benefit & adoption'!$G$4=\"2020-25\",'Product benefit & adoption'!BB11*'Product benefit & adoption'!$N11/1000000,'Product benefit & adoption'!$G$4=\"2015-20\",'Product benefit & adoption'!BB11*'Product benefit & adoption'!$L11/1000000)","v":0},{"$f":"_xlfn.IFS('Product benefit & adoption'!$G$4=\"ALL\",'Product benefit & adoption'!BC11*'Product benefit & adoption'!$P11/1000000,'Product benefit & adoption'!$G$4=\"2020-25\",'Product benefit & adoption'!BC11*'Product benefit & adoption'!$N11/1000000,'Product benefit & adoption'!$G$4=\"2015-20\",'Product benefit & adoption'!BC11*'Product benefit & adoption'!$L11/1000000)","v":0},{"$f":"_xlfn.IFS('Product benefit & adoption'!$G$4=\"ALL\",'Product benefit & adoption'!BD11*'Product benefit & adoption'!$P11/1000000,'Product benefit & adoption'!$G$4=\"2020-25\",'Product benefit & adoption'!BD11*'Product benefit & adoption'!$N11/1000000,'Product benefit & adoption'!$G$4=\"2015-20\",'Product benefit & adoption'!BD11*'Product benefit & adoption'!$L11/1000000)","v":0}]
{"$rows_left_out":98}
{"sheet":"PV calculation","index":4,"n_rows":30,"n_cols":55,"rows_kept":30,"cut":false,"hidden":false,"merged":[[28,1,28,10],[1,1,1,6],[27,1,27,10]]}
["H"]
[null,"Discounting adjustments to obtain net present value values of cash streams (in both nominal or real terms)"]
[]
[null,null,null,"1998-99","1999-2000","2000-01","2001-02","2002-03","2003-04","2004-05","2005-06","2006-07","2007-08","2008-09","2009-10","2010-11","2011-12","2012-13","2013-14","2014-15","2015-16","2016-17","2017-18","2018-19","2019-20","2020-21","2021-22","2022-23","2023-24","2024-25","2025-26","2026-27","2027-28","2028-29","2029-30","2030-31","2031-32","2032-33","2033-34","2034-35","2035-36","2036-37","2037-38","3038-39","2039-40","2040-41","2041-42","2042-43","2043-44","2044-45","2045-46","2046-47","2047-48","2048-49","2049-50"]
[null,"Year",null,"FY 1999","FY 2000","FY 2001","FY 2002","FY 2003","FY 2004","FY 2005","FY 2006","FY 2007","FY 2008","FY 2009","FY 2010","FY 2011","FY 2012","FY 2013","FY 2014","FY 2015","FY 2016","FY 2017","FY 2018","FY 2019","FY 2020","FY 2021","FY 2022","FY 2023","FY 2024","FY 2025","FY 2026","FY 2027","FY 2028","FY 2029","FY 2030","FY 2031","FY 2032","FY 2033","FY 2034","FY 2035","FY 2036","FY 2037","FY 2038","FY 2039","FY 2040","FY 2041","FY 2042","FY 2043","FY 2044","FY 2045","FY 2045","FY 2045","FY 2045","FY 2045","FY 2045"]
[]
{"$rows_left_out":25}
{"sheet":"Formatting","index":5,"n_rows":51,"n_cols":6,"rows_kept":51,"cut":false,"hidden":false,"merged":[]}
["H"]
[]
[]
[]
[]
[null,null,"Excel Format","Style Name","Comment","Example"]
{"$rows_left_out":45}